{"text_format":"1","workbook":"xlsx","n_sheets":8,"sheets":["Dati Gen","Computo-Massimali","SAL.30%","Enea SAL 30%","SAL.60%","Enea SAL 60%","SAL.Finale","Enea SAL Finale"],"not_rendered":{"charts":0,"images":0,"macros":1,"external_links":0,"defined_names":2,"comments":2,"pivot_tables":0},"unopened":[],"bounds":{"document_bytes":16777216,"sheet_cells":100000,"rows_first":2000,"rows_last":500,"rows_between":2000,"halvings":0,"cell_chars":16384,"cell_head_chars":4096},"cells_cut":0,"cells_raw":0,"read":"whole","date_system":"1900"}

{"sheet":"Dati Gen","index":0,"n_rows":32,"n_cols":27,"rows_kept":32,"cut":false,"hidden":false,"merged":[[31,8,31,9],[31,6,31,7],[23,2,23,8],[24,2,24,8],[22,9,22,10],[25,7,25,10],[26,1,26,4],[27,1,27,4],[8,2,8,3],[14,2,14,10],[16,2,16,8],[17,2,17,8],[15,9,15,10],[10,2,10,6],[15,7,15,8],[15,2,15,6],[13,2,13,10],[1,14,1,15],[14,14,14,15],[29,2,29,4],[9,2,9,4],[9,5,9,9],[3,1,3,2],[4,1,4,4],[7,2,7,8],[6,2,6,8],[22,2,22,6],[22,7,22,8],[18,2,18,5],[18,7,18,10],[25,2,25,5],[20,2,20,10],[21,2,21,10]]}
[0,null,null,null,null,null,null,null,"Pratica.110","Versione",1,null,null,null,null,null,null,null,null,null,null,null,null,null,null,null,0]
[null,"PRATICA SUPERBONUS 110%",null,"N.",1,null,null,null,"©2021 SIM srl - www.madosoft.it",null,null,null,null,null,"Titolare Licenza d'uso"]
["","Tipologia",null,null,null,null,null,null,null,null,null,null,null,null,"Cognome "]
[null,"Edificio Unifamiliare",null,null,1,null,null,null,null,null,null,null,null,null,"Nome"]
[null,{"$f":"IF('Dati Gen'!B4=\"Edificio Unifamiliare\", IF('Dati Gen'!E4>1,\"Inserire N.Unità Immobiliari =1\",\"\"),IF('Dati Gen'!E4<=1,\"Inserire N.Unità Immobiliari >1\",\"\"))","v":""},null,null,null,null,null,null,null,null,null,null,null,null,"Codice Fiscale"]
[null,"Dati Edificio",null,null,null,null,null,null,null,null,null,null,null,null,"P.Iva"]
[null,"Comune di Ubicazione","ROMA",null,null,null,null,null,null,"CAP",null,null,null,null,"Indirizzo"]
[null,"Indirizzo","Via Vitaliano",null,null,null,null,null,null,"N.",23,null,null,null,"CAP"]
[null,"Dati Catastali","Foglio",null,null,"Particella",null,"Sub.",null,"CAT.",null,null,null,null,"Città"]
[null,"Anno di Costruzione Immobile",null,null,null,"Superficie Totale Disperdente   :",null,null,null,null,null,null,null,null,"Provincia"]
[null,"Autorizzazione Edilizia","Edificio Storico senza Titolo Edilizio",null,null,null,null,{"$f":"IF(C11=\"Licenza Edilizia / Titolo Edilizio\",\"N.\",IF(C11=\"Concessione in Sanatoria\",\"N.\",\"\"))","v":""},null,{"$f":"IF(C11=\"Licenza Edilizia / Titolo Edilizio\",\"Data\",IF(C11=\"Concessione in Sanatoria\",\"Data\",\"\"))","v":""},null,null,null,null,"Telefono"]
[null,null,null,null,null,null,null,null,null,null,null,null,null,null,"Mail"]
[null,"Dati Committenti",null,null,null,null,null,null,null,null,null,null,null,null,"Codice Univoco"]
[null,"Cognome Nome","Rossi Mario",null,null,null,null,null,null,null,null,null,null,null,"Mail PEC"]
[null,"Codice Fiscale","cc"]
[null,"Comune di Nascita",null,null,null,null,null,"Data Nascita",null,null,null,null,null,null,"Controlla Aggiornamenti"]
[null,"Comune di Residenza",null,null,null,null,null,null,null,"CAP",null,null,null,null,"Licenza N.","Versione DEMO",{"$f":"IF(MID(P17,1,2)<>\"AP\",\"Acquista Licenza x 100 Attivazioni\",\"\")","v":"Acquista Licenza x 100 Attivazioni"}]
[null,"Indirizzo",null,null,null,null,null,null,null,"N."]
[null,"Telefono",null,null,null,null,"Email"]
[]
[null,"Cognome Nome"]
[null,"Codice Fiscale"]
[null,"Comune di Nascita",null,null,null,null,null,"Data Nascita"]
[null,"Comune di Residenza",null,null,null,null,null,null,null,"CAP"]
[null,"Indirizzo",null,null,null,null,null,null,null,"N."]
[null,"Telefono",null,null,null,null,"Email"]
[null,{"$f":"IF(C21<>\"\",CONCATENATE(C14, \" - \",C21),C14)","v":"Rossi Mario"}]
[null,{"$f":"IF(K8<>\"\",CONCATENATE(C8,\", \",K8),C8)","v":"Via Vitaliano, 23"}]
[]
[null,"Data Inizio Lavori","2021-03-15"]
[]
[null,"Relazione ex Legge 10/91  Depositata al Comune in Data ",null,null,null,null,"2021-03-15",null,"Prot. N.",null,25658]

{"sheet":"Computo-Massimali","index":1,"n_rows":44,"n_cols":29,"rows_kept":44,"cut":false,"hidden":false,"merged":[[44,5,44,6],[4,20,4,21],[4,23,4,24],[4,26,4,27],[12,23,12,24],[12,26,12,27],[5,2,5,3],[5,20,5,21],[5,23,5,24],[5,26,5,27],[6,2,6,3],[6,9,6,16],[7,2,7,3],[7,9,7,16],[8,2,8,3],[14,2,14,3],[14,20,14,21],[15,2,15,3],[15,20,15,21],[13,20,13,21],[8,9,8,16],[9,2,9,3],[9,9,9,16],[22,2,22,3],[2,5,2,8],[3,5,3,8],[18,2,18,3],[18,20,18,21],[18,26,18,27],[19,2,19,3],[19,20,19,21],[19,26,19,27],[16,2,16,3],[16,20,16,21],[16,26,16,28],[17,2,17,3],[17,20,17,21],[17,26,17,27],[13,23,13,24],[13,26,13,27],[3,23,3,24],[10,23,10,24],[10,26,10,27],[6,23,6,24],[6,26,6,27],[7,23,7,24],[7,26,7,27],[8,23,8,24],[22,20,22,21],[22,26,22,27],[23,20,23,21],[23,26,23,27],[20,2,20,3],[20,20,20,21],[20,26,20,27],[21,2,21,3],[21,20,21,21],[21,26,21,27],[26,2,26,3],[26,20,26,21],[26,26,26,27],[27,2,27,3],[27,20,27,21],[27,26,27,27],[24,20,24,21],[24,26,24,27],[25,2,25,3],[25,20,25,21],[25,26,25,27],[34,26,34,27],[36,8,36,15],[32,2,32,3],[32,20,32,21],[32,26,32,27],[33,2,33,3],[33,20,33,21],[33,26,33,27],[28,2,28,3],[28,20,28,21],[28,26,28,27],[29,2,29,3],[29,20,29,21],[29,26,29,27],[8,26,8,27],[9,23,9,24],[9,26,9,27],[1,22,1,24],[1,20,1,21],[1,25,1,27],[11,20,11,21],[11,22,11,24],[11,25,11,27],[2,26,2,27],[3,26,3,27],[2,23,2,24],[6,20,6,21],[7,20,7,21],[8,20,8,21],[9,20,9,21],[2,20,2,21],[3,20,3,21]]}
[]
[null,null,null,null,null,null,null,null,null,null,null,null,null,null,null,null,null,null,null,"PARCELLA","imponibile",null,"c.cassa",null,null,"iva",null,null,"totale"]
[null,null,"Verifica Massimali Superbonus",null,null,{"$f":"'Dati Gen'!B27","v":"Rossi Mario"},null,null,null,null,null,null,null,null,null,{"$f":"'Dati Gen'!I2","v":"©2021 SIM srl - www.madosoft.it"},null,null,null,"Ape Ante",800.95,null,0.04,{"$f":"U3*W3","v":32.038000000000004},null,0,{"$f":"(U3+X3)*Z3","v":0},null,{"$f":"U3+X3+AA3","v":832.98800000000006}]
[null,null,{"$f":"'Dati Gen'!B4","v":"Edificio Unifamiliare"},{"$f":"IF('Dati Gen'!E4>1,'Dati Gen'!E4,\"\")","v":""},null,{"$f":"'Dati Gen'!B28","v":"Via Vitaliano, 23"},null,null,null,null,null,null,null,null,null,{"$f":"'Dati Gen'!I1","v":"Pratica.110"},null,null,null,"Progettazione e DL",20725.259999999998,null,0.04,829.0104,null,0,{"$f":"(U4+X4)*Z4","v":0},null,{"$f":"U4+X4+AA4","v":21554.270399999998}]
[null,null,null,null,null,null,null,null,null,null,null,null,null,null,null,null,null,null,null,"Coord.SicurezzaEsec.",4000,null,0.04,160,null,0.22,915.2,null,{"$f":"U5+X5+AA5","v":5075.2}]
[null,null,null,null,null,"Imponibile","%iva","IVA","Importo",null,null,null,null,null,null,null,null,null,null,"Ape Post",1028.45,null,0.04,41.138000000000005,null,0,0,null,1069.588]
[null,null,"Importo complessivo Lavori",null,null,134860.28,0.1,{"$f":"F7*G7","v":13486.028},{"$f":"F7+H7","v":148346.30799999999},{"$f":"IF(ABS(H35-F7)>0.001,\"Importo Lavori non corretto - completare Tabella 2\",\"V.\")","v":"V."},null,null,null,null,null,null,null,null,null,null,null,null,0.04,0,null,0,0,null,0]
[null,null,"di cui Oneri/Lavori x Sicurezza",null,null,8032.08,0.1,{"$f":"F8*G8","v":803.20800000000008},{"$f":"F8+H8","v":8835.2880000000005},{"$f":"IF(ABS(G35-F8)>0.001,\"Importo Sicurezza non corretto - completare Tabella 2 oppure Click su Proporzionale\",\"V.\")","v":"V."},null,null,null,null,null,null,null,null,null,null,null,null,0.04,0,null,0,0,null,0]
[null,null,"Importo b.a.",null,null,{"$f":"F7-F8","v":126828.2},0.1,{"$f":"F9*G9","v":12682.82},{"$f":"F9+H9","v":139511.01999999999},{"$f":"IF(ABS(F35-F9)>0.001,\"Importo b.a. non corretto - completare Tabella 2\",\"V.\")","v":"V."},null,null,null,null,null,null,null,null,null,null,null,null,0.04,0,null,0,0,null,0]
[null,null,"Spese tecniche (compresa iva)",null,null,{"$f":"AC14","v":30243.153632640002},null,null,{"$f":"AC14","v":30243.153632640002},{"$f":"IF(ABS(I10-K35)>0.001,\"Importo Spese Tecniche non corretto - completare Tabella 2 oppure Click su Proporzionale\",\"V.\")","v":"V."},null,null,null,null,null,null,null,null,null,null,null,null,0.04,0,null,0,0,null,0]
[null,null,null,null,null,null,null,null,{"$f":"I7+I10","v":178589.46163263998},null,null,null,null,null,null,null,null,null,null,null,null,{"$f":"SUM(U3:V10)","v":26554.66},null,{"$f":"SUM(X3:Y10)","v":1062.1864},null,null,{"$f":"SUM(AA3:AB10)","v":915.2},null,{"$f":"SUM(AC3:AC8)","v":28532.046399999999}]
[null,null,null,null,null,null,null,null,null,null,null,null,null,null,null,null,null,null,null,null,"imponibile",null,"c.cassa",null,null,"iva",null,null,"totale"]
[null,null,null,null,null,null,null,null,null,null,null,null,null,null,null,null,null,null,null,"Visto Conformità",0.01,{"$f":"U13*F7","v":1348.6028000000001},0.04,{"$f":"V13*W13","v":53.944112000000004},null,0.22,{"$f":"(V13+X13)*Z13","v":308.56032063999999},null,{"$f":"V13+X13+AA13","v":1711.1072326399999}]
[null,null,null,null,null,null,null,null,null,null,null,null,null,null,null,null,null,null,null,null,{"$f":"V13+V11","v":27903.2628},null,null,{"$f":"X13+X11","v":1116.130512},null,null,{"$f":"AA13+AA11","v":1223.7603206399999},null,{"$f":"SUM(U14:AB14)","v":30243.153632640002}]
[null,null,"Lavorazione",null,null,"Importo Lavori","Incidenza Sicurezza","Imponibile","Iva","Importo c.iva","Spese tecniche","Totale","Sup. Interv.","Costo Unitario",null,"Verifica Costo Un.","Detrazione Ammessa",null,"Verifica Max","Massimale costo","Massimale spesa"]
[null,null,"Isolamento pareti perimetrali",null,"Esterno",20381.52,1290.7697117959569,{"$f":"SUM(F16:G16)","v":21672.289711795958},{"$f":"F16*$G$9+G16*$G$8","v":2167.2289711795956},{"$f":"H16+I16","v":23839.518682975555},4860.1292112162309,{"$f":"SUM(J16:K16)","v":28699.647894191785},308.33999999999997,{"$f":"IF(ISNUMBER(F16)=TRUE,F16/M16,0)","v":66.100797820587673},null,{"$f":"IF(T16<>0,IF(N16>T16,\"KO\",\"ok\"),\"ok\")","v":"ok"},{"$f":"IF(L16<=U16,L16*1.1,U16*1.1)","v":31569.612683610965},null,{"$f":"IF(L16>Q16,\"KO\",IF(L16>U16,\"ok<\",\"ok\"))","v":"ok"},{"$f":"IF(E16=\"Parete Ventilata\",200,IF(E16=\"Interno\",80,150))","v":150},{"$f":"IF('Dati Gen'!$B$4=\"Edificio Unifamiliare\",50000,IF('Dati Gen'!$E$4>8,30000*'Dati Gen'!$E$4,40000*'Dati Gen'!$E$4))","v":50000}]
[null,null,"Isolamento coperture",null,"Esterno",14415.66,912.94944162891215,{"$f":"SUM(F17:G17)","v":15328.609441628912},{"$f":"F17*$G$9+G17*$G$8","v":1532.8609441628912},{"$f":"H17+I17","v":16861.470385791803},3437.5242922423117,{"$f":"SUM(J17:K17)","v":20298.994678034116},null,{"$f":"IF(ISNUMBER(M17)=TRUE,F17/M17,0)","v":0},null,{"$f":"IF(T17<>0,IF(N17>T17,\"KO\",\"ok\"),\"ok\")","v":"ok"},22328.89414583753,null,"ok",{"$f":"IF(E17=\"Copertura Ventilata\",250,IF(E17=\"Interno\",100,230))","v":230},{"$f":"IF('Dati Gen'!$B$4=\"Edificio Unifamiliare\",50000,IF('Dati Gen'!$E$4>8,30000*'Dati Gen'!$E$4,40000*'Dati Gen'!$E$4))","v":50000},null,null,null,null,null,"Cessione Credito"]
[null,null,"Isolamento Pavimenti",null,"Esterno",null,0,0,0,{"$f":"H18+I18","v":0},0,{"$f":"SUM(J18:K18)","v":0},60,0,null,"ok",0,null,"ok",{"$f":"IF(E18=\"Interno/terreno\",150,120)","v":120},{"$f":"IF('Dati Gen'!$B$4=\"Edificio Unifamiliare\",50000,IF('Dati Gen'!$E$4>8,30000*'Dati Gen'!$E$4,40000*'Dati Gen'!$E$4))","v":50000},null,null,null,null,null,"Quota Impresa",null,"Quota Tecnico"]
[null,null,"Isolamento sup. verticali e/o orizzontali",null,null,{"$f":"SUM(F16:F18)","v":34797.18},{"$f":"SUM(G16:G18)","v":2203.7191534248691},37000.899153424871,{"$f":"SUM(I16:I18)","v":3700.0899153424871},{"$f":"SUM(J16:J18)","v":40700.989068767361},{"$f":"SUM(K16:K18)","v":8297.6535034585431},{"$f":"SUM(L16:L18)","v":48998.642572225901},{"$f":"SUM(M16:M18)","v":368.34},94.470272031275456,null,"ok",53898.506829448495,null,"ok",null,{"$f":"IF('Dati Gen'!$B$4=\"Edificio Unifamiliare\",50000,IF('Dati Gen'!$E$4>8,30000*'Dati Gen'!$E$4,40000*'Dati Gen'!$E$4))","v":50000},null,null,null,null,null,{"$f":"IF(Q19<>0,J19*Q19/L19,0)","v":44771.087975644099},null,{"$f":"IF(Q19<>0,K19*Q19/L19,0)","v":9127.4188538043982}]
[null,null,"Serramenti",null,"Zone A, B e C",0,0,0,{"$f":"F20*$G$9+G20*$G$8","v":0},{"$f":"H20+I20","v":0},0,{"$f":"SUM(J20:K20)","v":0},null,0,null,"ok",0,null,"ok",{"$f":"IF(E20=\"Zone A, B e C\",550,650)","v":550},{"$f":"60000*'Dati Gen'!$E$4/1.1","v":54545.454545454544},null,null,null,null,null,0,null,0]
[null,null,"Serramenti + chiusure oscuranti",null,"Zone D, E ed F",11582.37,733.51606684948615,12315.886066849487,1231.5886066849487,13547.474673534436,2761.9046545239266,{"$f":"SUM(J21:K21)","v":16309.379328058363},40.19,288.19034585717844,null,{"$f":"IF(T21<>0,IF(N21>T21,\"KO\",\"ok\"),\"ok\")","v":"ok"},17940.317260864202,null,"ok",{"$f":"IF(E21=\"Zone A, B e C\",650,750)","v":750},{"$f":"60000*'Dati Gen'!$E$4/1.1","v":54545.454545454544},null,null,null,null,null,14902.222140887881,null,3038.0951199763194]
[null,null,"Schermature solari e chiusure Oscuranti",null,null,0,0,{"$f":"SUM(F22:G22)","v":0},0,0,0,{"$f":"SUM(J22:K22)","v":0},null,0,null,"ok",0,null,"ok",230,{"$f":"60000*'Dati Gen'!$E$4/1.1","v":54545.454545454544},null,null,null,null,null,0,null,0]
[null,null,"Solare Termico    - con collettori solari",null,"Piani Vetrati",4925.08,311.90726168470417,5236.9872616847042,523.69872616847044,5760.685987853175,1174.4229755054639,6935.1089633586389,null,0,null,"ok",7628.6198596945032,null,"ok",{"$f":"IF(E23=\"Scoperti\",750,IF(E23=\"Piani vetrati\",1000,1250))","v":1000},{"$f":"IF('Dati Gen'!$B$4=\"Edificio Unifamiliare\",30000,IF('Dati Gen'!$E$4>8,15000*'Dati Gen'!$E$4,20000*'Dati Gen'!$E$4))","v":30000},null,null,null,null,null,6336.7545866384926,null,1291.8652730560102]
[null,null,"Solare Fotovoltaico              kWp",6,"Piani Vetrati",13474.07,853.31817502416664,14327.388175024167,1432.7388175024169,15760.126992526584,3212.9949753878609,18973.121967914445,null,0,null,"ok",{"$f":"IF(L24<=U24,L24*1.1,U24*1.1)","v":15840.000000000002},null,"KO",{"$f":"IF(E24=\"Scoperti\",750,IF(E24=\"Piani vetrati\",1000,1250))","v":1000},{"$f":"IF(C24=\"Solare Fotovoltaico              kWp\",IF(D24*2400<48000*'Dati Gen'!$E$4,D24*2400,48000*'Dati Gen'!$E$4),IF(D24*1600<48000*'Dati Gen'!$E$4,D24*1600,48000*'Dati Gen'!$E$4))","v":14400},null,null,null,null,null,{"$f":"IF(Q24<>0,J24*Q24/L24,0)","v":13157.582183037111},null,{"$f":"IF(Q24<>0,K24*Q24/L24,0)","v":2682.4178169628904}]
[null,null,"Sistema di Accumulo           kWh",10,null,6455.26,408.81416546793224,6864.0741654679323,686.40741654679334,7550.481582014726,1539.3060903655251,9089.787672380251,null,0,null,"ok",{"$f":"IF(L25<=U25,L25*1.1,U25*1.1)","v":9998.7664396182772},null,{"$f":"IF(L25>Q25,\"KO\",IF(L25>U25,\"ok<\",\"ok\"))","v":"ok"},null,{"$f":"IF(D25*1000<48000*'Dati Gen'!$E$4,D25*1000,48000*'Dati Gen'!$E$4)","v":10000},null,null,null,null,null,{"$f":"IF(Q25<>0,J25*Q25/L25,0)","v":8305.5297402161996},null,{"$f":"IF(Q25<>0,K25*Q25/L25,0)","v":1693.2366994020776}]
[null,null,"Impianti climatizzazione e ACS",null,null,21332.86,1351.0184497517114,{"$f":"SUM(F26:G26)","v":22683.878449751712},2268.387844975171,24952.266294726884,5086.9834965113523,30039.249791238235,null,0,null,"vedi All.I",33000,null,"ok<","vedi All.I",{"$f":"IF('Dati Gen'!$B$4=\"Edificio Unifamiliare\",30000,IF('Dati Gen'!$E$4>8,15000*'Dati Gen'!$E$4,20000*'Dati Gen'!$E$4))","v":30000},null,null,null,null,null,27411.629566267045,null,5588.3704337329555]
[null,null,"Impianti Biomassa",null,null,0,0,0,0,0,0,0,null,0,null,"vedi All.I",0,null,"ok","vedi All.I",{"$f":"IF('Dati Gen'!$B$4=\"Edificio Unifamiliare\",30000,IF('Dati Gen'!$E$4>8,15000*'Dati Gen'!$E$4,20000*'Dati Gen'!$E$4))","v":30000},null,null,null,null,null,0,null,0]
[null,null,"Sistemi di Building Automation",null,null,5541.15,350.92321811710644,5892.0732181171061,589.2073218117107,6481.2805399288172,1321.3295627889843,7802.6101027178011,null,0,null,{"$f":"IF(T28<>0,IF(N28>T28,\"KO\",\"ok\"),\"ok\")","v":"ok"},8582.8711129895819,null,"ok",50,{"$f":"15000*'Dati Gen'!$E$4","v":15000},null,null,null,null,null,7129.4085939216993,null,1453.4625190678828]
[null,null,"Colonnine di Ricarica",null,null,0,0,0,0,0,0,0,null,0,null,{"$f":"IF(T29<>0,IF(N29>T29,\"KO\",\"ok\"),\"ok\")","v":"ok"},0,null,"ok",null,{"$f":"IF('Dati Gen'!$B$4=\"Edificio Unifamiliare\",2000,IF('Dati Gen'!$E$4>8,1200*'Dati Gen'!$E$4,1500*'Dati Gen'!$E$4))","v":2000},null,null,null,null,null,0,null,0]
[null,null,"SismaBonus",null,null,null,0,0,0,0,0,0,null,0,null,{"$f":"IF(T30<>0,IF(N30>T30,\"KO\",\"ok\"),\"ok\")","v":"ok"},0,null,"ok",null,{"$f":"IF('Dati Gen'!$B$4=\"Edificio Unifamiliare\",96000,96000*'Dati Gen'!$E$4)","v":96000},null,null,null,null,null,0,null,0]
[null,null,null,null,null,null,null,null,null,null,null,null,null,"Totale interventi 110",null,null,{"$f":"SUM(Q19:Q30)","v":146889.08150261507}]
[]
[null,null,"Lavori Ristrutturazione",null,0.5,28720.23,1818.8635096800238,{"$f":"SUM(F33:G33)","v":30539.093509680024},{"$f":"F33*$G$9+G33*$G$8","v":3053.9093509680024},{"$f":"H33+I33","v":33593.002860648026},6848.558341457544,{"$f":"SUM(J33:K33)","v":40441.561202105571},null,{"$f":"IF(ISNUMBER(M33)=TRUE,H33/M33,0)","v":0},null,{"$f":"IF(T33<>0,IF(N33>T33,\"KO\",\"ok\"),\"ok\")","v":"ok"},{"$f":"IF(L33<=U33*E33,L33*E33,U33*E33)","v":20220.780601052786},null,{"$f":"IF(L33>U33,\"KO\",\"ok<\")","v":"ok<"},0,{"$f":"96000*'Dati Gen'!E4","v":96000},null,null,null,null,null,{"$f":"IF(Q33<>0,J33*Q33/L33,0)","v":16796.501430324013},null,{"$f":"IF(Q33<>0,K33*Q33/L33,0)","v":3424.279170728772}]
[null,null,"-",null,0,null,0,0,0,{"$f":"H34+I34","v":0},0,0,null,{"$f":"IF(ISNUMBER(M34)=TRUE,H34/M34,0)","v":0},null,{"$f":"IF(T34<>0,IF(N34>T34,\"KO\",\"ok\"),\"ok\")","v":"ok"},{"$f":"IF(L34<=U34*E34,L34*E34,U34*E34)","v":0},null,{"$f":"IF(L34>U34,\"KO\",\"ok<\")","v":"ok<"},0,{"$f":"96000*'Dati Gen'!E4","v":96000},null,null,null,null,null,{"$f":"IF(Q34<>0,J34*Q34/L34,0)","v":0},null,{"$f":"IF(Q34<>0,K34*Q34/L34,0)","v":0}]
[null,null,"Totali x verifica",null,null,{"$f":"SUM(F19:F34)","v":126828.2},{"$f":"SUM(G19:G34)","v":8032.079999999999},{"$f":"SUM(H19:H34)","v":134860.28},null,{"$f":"SUM(J19:J34)","v":148346.30800000002},{"$f":"SUM(K19:K34)","v":30243.153599999201},{"$f":"SUM(L19:L34)","v":178589.46159999919},null,"Totale altri interventi",null,null,{"$f":"SUM(Q33:Q34)","v":20220.780601052786},null,null,null,null,null,null,null,null,null,{"$f":"SUM(AA16:AA34)","v":138810.71621693653},null,{"$f":"SUM(AC16:AC34)","v":28299.145886731305}]
[]
[null,null,null,null,null,null,"Importo Lavori + Iva + Spese Tecniche Comp. Iva :",{"$f":"L35","v":178589.46159999919},{"$f":"IF(ABS(H37-I11)<=0.001,\"V.\",\"Importo Lavori non corretto - Corregere Imponibili Tabella 1 oppure Completare Tabella 2\")","v":"V."}]
[null,null,null,null,null,null,"Importo Detrazione Fiscale :",{"$f":"Q31+Q35","v":167109.86210366787}]
[]
[null,null,null,null,null,null,"Quota % effettiva per cessione credito a Banca o Impresa Interventi 110:",{"$f":"100/110","v":0.90909090909090906},{"$f":"H40*110","v":100}]
[null,null,null,null,null,null,"Quota % effettiva per cessione credito a Banca o Impresa Interventi NO 110:",0.875,{"$f":"H41*100","v":87.5},"Quota Impresa","Quota Tec."]
[null,null,null,null,null,null,"Netto a seguito Cessione Credito a Banca/Impresa :",{"$f":"H40*Q31+H41*Q35","v":151228.71166466217},null,{"$f":"AA35*H42/H38","v":125618.95219393869},{"$f":"AC35*H42/H38","v":25609.759470723457}]
[null,null,null,null,null,null,"Quota a carico cliente :",{"$f":"H37-H42","v":27360.749935337022},null,{"$f":"H43*AA35/H38","v":22727.355806209303},{"$f":"H43*AC35/H38","v":4633.3941291277133}]
[null,null,null,null,null,null,{"$f":"IF(H40=0,\"Detrazione Fiscale spettante : \",\"\")","v":""},{"$f":"IF(H40=0,Q35,\"\")","v":""},null,{"$f":"SUM(J42:J43)","v":148346.30800014798},{"$f":"SUM(K42:K43)","v":30243.153599851168}]

{"sheet":"SAL.30%","index":2,"n_rows":41,"n_cols":20,"rows_kept":41,"cut":false,"hidden":false,"merged":[[5,2,5,3],[5,4,5,5],[2,2,2,3],[2,5,2,8],[3,2,3,3],[3,5,3,8],[4,2,4,4],[8,2,8,3],[8,4,8,5],[9,2,9,3],[9,4,9,5],[6,2,6,3],[6,4,6,5],[7,2,7,3],[7,4,7,5],[12,2,12,3],[12,4,12,5],[14,2,14,3],[14,4,14,5],[15,2,15,3],[15,4,15,5],[16,2,16,3],[16,4,16,5],[17,2,17,3],[17,4,17,5],[18,2,18,3],[18,4,18,5],[19,2,19,3],[19,4,19,5],[20,2,20,3],[20,4,20,5],[21,2,21,3],[21,4,21,5],[22,2,22,3],[22,4,22,5],[23,4,23,5],[24,4,24,5],[25,2,25,3],[25,4,25,5],[26,2,26,3],[26,4,26,5],[27,2,27,3],[27,4,27,5],[28,2,28,3],[28,4,28,5],[29,2,29,3],[29,4,29,5],[30,4,30,5],[32,4,32,5],[33,4,33,5],[38,15,38,18],[38,2,38,3],[38,4,38,5],[40,10,40,13],[34,4,34,5],[37,2,37,3],[37,4,37,5]]}
[]
[]
[null,null,"STATO AVANZAMENTO LAVORI N.1",null,null,{"$f":"'Dati Gen'!B27","v":"Rossi Mario"},null,null,null,null,null,null,null,{"$f":"'Dati Gen'!I2","v":"©2021 SIM srl - www.madosoft.it"}]
[null,null,"Data 27/03/2021",null,null,{"$f":"'Dati Gen'!B28","v":"Via Vitaliano, 23"},null,null,null,null,null,null,null,{"$f":"'Dati Gen'!I1","v":"Pratica.110"}]
[]
[null,null,null,null,"Imponibile",null,"%iva","IVA","Importo"]
[null,null,"Importo complessivo Lavori",null,{"$f":"'Computo-Massimali'!F7","v":134860.28},null,{"$f":"'Computo-Massimali'!G7","v":0.1},{"$f":"'Computo-Massimali'!H7","v":13486.028},{"$f":"'Computo-Massimali'!I7","v":148346.30799999999}]
[null,null,"di cui Oneri/Lavori x Sicurezza",null,{"$f":"'Computo-Massimali'!F8","v":8032.08},null,{"$f":"'Computo-Massimali'!G8","v":0.1},{"$f":"'Computo-Massimali'!H8","v":803.20800000000008},{"$f":"'Computo-Massimali'!I8","v":8835.2880000000005}]
[null,null,"Importo b.a.",null,{"$f":"'Computo-Massimali'!F9","v":126828.2},null,{"$f":"'Computo-Massimali'!G9","v":0.1},{"$f":"'Computo-Massimali'!H9","v":12682.82},{"$f":"'Computo-Massimali'!I9","v":139511.01999999999}]
[null,null,"Spese tecniche (compresa iva)",null,{"$f":"'Computo-Massimali'!F10","v":30243.153632640002},null,{"$f":"'Computo-Massimali'!G10","v":0},{"$f":"'Computo-Massimali'!H10","v":0},{"$f":"'Computo-Massimali'!I10","v":30243.153632640002}]
[null,null,null,null,null,null,null,null,{"$f":"'Computo-Massimali'!I11","v":178589.46163263998}]
[null,null,"Lavori Eseguiti"]
[null,null,"Oneri/Lavori x Sicurezza"]
[]
[null,null,"Lavorazione",null,"Importo Lavori Eseguiti  ",null,"Incidenza Sicurezza","Imponibile","Iva","Importo c.iva","Spese tecniche","Totale","% SAL","Detrazione ",null,null,{"$f":"'Computo-Massimali'!U15","v":"Massimale spesa"},null,"Ripartizione Spese Tecniche","Fatturare"]
[null,null,{"$f":"'Computo-Massimali'!C16","v":"Isolamento pareti perimetrali"},null,6500,null,{"$f":"$E$13*E16/$E$9","v":0},{"$f":"SUM(E16:G16)","v":6500},{"$f":"H16*'Computo-Massimali'!$G$9","v":650},{"$f":"SUM(H16:I16)","v":7150},{"$f":"'Computo-Massimali'!$AC$14*J16/$I$7","v":1457.6604661666136},{"$f":"SUM(J16:K16)","v":8607.6604661666133},{"$f":"IF(L16>0,L16/'Computo-Massimali'!L16,\"\")","v":0.29992216273526567},{"$f":"IF(L16<=Q16,L16*1.1,Q16*1.1)","v":9468.426512783275},null,null,{"$f":"'Computo-Massimali'!U16","v":50000},null,{"$f":"IF('Computo-Massimali'!T3<>0,'Computo-Massimali'!T3,\"-\")","v":"Ape Ante"},{"$f":"$K$39*'Computo-Massimali'!AC3/'Computo-Massimali'!$AC$14","v":40.148381717730388}]
[null,null,{"$f":"'Computo-Massimali'!C17","v":"Isolamento coperture"},null,null,null,{"$f":"$E$13*E17/$E$9","v":0},{"$f":"SUM(E17:G17)","v":0},{"$f":"H17*'Computo-Massimali'!$G$9","v":0},{"$f":"SUM(H17:I17)","v":0},{"$f":"'Computo-Massimali'!$AC$14*J17/$I$7","v":0},{"$f":"SUM(J17:K17)","v":0},{"$f":"IF(L17>0,L17/'Computo-Massimali'!L17,\"\")","v":""},0,null,null,{"$f":"'Computo-Massimali'!U17","v":50000},null,{"$f":"IF('Computo-Massimali'!T4<>0,'Computo-Massimali'!T4,\"-\")","v":"Progettazione e DL"},{"$f":"$K$39*'Computo-Massimali'!AC4/'Computo-Massimali'!$AC$14","v":1038.8733999365861}]
[null,null,{"$f":"'Computo-Massimali'!C18","v":"Isolamento Pavimenti"},null,null,null,{"$f":"$E$13*E18/$E$9","v":0},0,{"$f":"H18*'Computo-Massimali'!$G$9","v":0},0,{"$f":"'Computo-Massimali'!$AC$14*J18/$I$7","v":0},0,{"$f":"IF(L18>0,L18/'Computo-Massimali'!L18,\"\")","v":""},0,null,null,{"$f":"'Computo-Massimali'!U18","v":50000},null,{"$f":"IF('Computo-Massimali'!T5<>0,'Computo-Massimali'!T5,\"-\")","v":"Coord.SicurezzaEsec."},{"$f":"$K$39*'Computo-Massimali'!AC5/'Computo-Massimali'!$AC$14","v":244.61464858296307}]
[null,null,{"$f":"'Computo-Massimali'!C19","v":"Isolamento sup. verticali e/o orizzontali"},null,{"$f":"SUM(E16:F18)","v":6500},null,{"$f":"SUM(G16:G18)","v":0},{"$f":"SUM(H16:H18)","v":6500},{"$f":"SUM(I16:I18)","v":650},{"$f":"SUM(J16:J18)","v":7150},{"$f":"SUM(K16:K18)","v":1457.6604661666136},{"$f":"IF('Dati Gen'!P17=\"Versione DEMO\",\"Versione DEMO\",SUM(J19:K19))","v":"Versione DEMO"},{"$f":"IF(L19>0,L19/'Computo-Massimali'!L19,\"\")","v":{"$error":"#VALUE!"}},55000.000000000007,null,null,{"$f":"'Computo-Massimali'!U19","v":50000},null,{"$f":"IF('Computo-Massimali'!T6<>0,'Computo-Massimali'!T6,\"-\")","v":"Ape Post"},{"$f":"$K$39*'Computo-Massimali'!AC6/'Computo-Massimali'!$AC$14","v":51.552035929333684}]
[null,null,{"$f":"'Computo-Massimali'!C20","v":"Serramenti"},null,null,null,{"$f":"$E$13*E20/$E$9","v":0},0,{"$f":"H20*'Computo-Massimali'!$G$9","v":0},0,{"$f":"'Computo-Massimali'!$AC$14*J20/$I$7","v":0},0,{"$f":"IF(L20>0,L20/'Computo-Massimali'!L20,\"\")","v":""},0,null,null,{"$f":"'Computo-Massimali'!U20","v":54545.454545454544},null,{"$f":"IF('Computo-Massimali'!T7<>0,'Computo-Massimali'!T7,\"-\")","v":"-"},{"$f":"$K$39*'Computo-Massimali'!AC7/'Computo-Massimali'!$AC$14","v":0}]
[null,null,{"$f":"'Computo-Massimali'!C21","v":"Serramenti + chiusure oscuranti"},null,null,null,0,0,{"$f":"H21*'Computo-Massimali'!$G$9","v":0},0,{"$f":"'Computo-Massimali'!$AC$14*J21/$I$7","v":0},0,{"$f":"IF(L21>0,L21/'Computo-Massimali'!L21,\"\")","v":""},0,null,null,{"$f":"'Computo-Massimali'!U21","v":54545.454545454544},null,{"$f":"IF('Computo-Massimali'!T8<>0,'Computo-Massimali'!T8,\"-\")","v":"-"},{"$f":"$K$39*'Computo-Massimali'!AC8/'Computo-Massimali'!$AC$14","v":0}]
[null,null,{"$f":"'Computo-Massimali'!C22","v":"Schermature solari e chiusure Oscuranti"},null,null,null,0,0,{"$f":"H22*'Computo-Massimali'!$G$9","v":0},0,{"$f":"'Computo-Massimali'!$AC$14*J22/$I$7","v":0},0,{"$f":"IF(L22>0,L22/'Computo-Massimali'!L22,\"\")","v":""},0,null,null,{"$f":"'Computo-Massimali'!U22","v":54545.454545454544},null,{"$f":"IF('Computo-Massimali'!T9<>0,'Computo-Massimali'!T9,\"-\")","v":"-"},{"$f":"$K$39*'Computo-Massimali'!AC9/'Computo-Massimali'!$AC$14","v":0}]
[null,null,{"$f":"'Computo-Massimali'!C23","v":"Solare Termico    - con collettori solari"},null,null,null,0,0,{"$f":"H23*'Computo-Massimali'!$G$9","v":0},0,{"$f":"'Computo-Massimali'!$AC$14*J23/$I$7","v":0},0,{"$f":"IF(L23>0,L23/'Computo-Massimali'!L23,\"\")","v":""},0,null,null,{"$f":"'Computo-Massimali'!U23","v":30000},null,{"$f":"IF('Computo-Massimali'!T10<>0,'Computo-Massimali'!T10,\"-\")","v":"-"},{"$f":"$K$39*'Computo-Massimali'!AC10/'Computo-Massimali'!$AC$14","v":0}]
[null,null,{"$f":"'Computo-Massimali'!C24","v":"Solare Fotovoltaico              kWp"},{"$f":"'Computo-Massimali'!D24","v":6},null,null,0,0,{"$f":"H24*'Computo-Massimali'!$G$9","v":0},0,{"$f":"'Computo-Massimali'!$AC$14*J24/$I$7","v":0},0,{"$f":"IF(L24>0,L24/'Computo-Massimali'!L24,\"\")","v":""},0,null,null,{"$f":"'Computo-Massimali'!U24","v":14400},null,{"$f":"IF('Computo-Massimali'!T13<>0,'Computo-Massimali'!T13,\"-\")","v":"Visto Conformità"},{"$f":"$K$39*'Computo-Massimali'!AC13/'Computo-Massimali'!$AC$14","v":82.472000000000008}]
[null,null,{"$f":"'Computo-Massimali'!C25","v":"Sistema di Accumulo           kWh"},{"$f":"'Computo-Massimali'!D25","v":10},null,null,0,0,{"$f":"H25*'Computo-Massimali'!$G$9","v":0},0,{"$f":"'Computo-Massimali'!$AC$14*J25/$I$7","v":0},0,{"$f":"IF(L25>0,L25/'Computo-Massimali'!L25,\"\")","v":""},0,null,null,{"$f":"'Computo-Massimali'!U25","v":10000},null,null,{"$f":"SUM(T16:T24)","v":1457.6604661666133}]
[null,null,{"$f":"'Computo-Massimali'!C26","v":"Impianti climatizzazione e ACS"},null,null,null,0,0,{"$f":"H26*'Computo-Massimali'!$G$9","v":0},0,{"$f":"'Computo-Massimali'!$AC$14*J26/$I$7","v":0},{"$f":"IF('Dati Gen'!P17=\"Versione DEMO\",\"Versione DEMO\",SUM(J26:K26))","v":"Versione DEMO"},{"$f":"IF(L26>0,L26/'Computo-Massimali'!L26,\"\")","v":{"$error":"#VALUE!"}},33000,null,null,{"$f":"'Computo-Massimali'!U26","v":30000}]
[null,null,{"$f":"'Computo-Massimali'!C27","v":"Impianti Biomassa"},null,null,null,0,0,{"$f":"H27*'Computo-Massimali'!$G$9","v":0},0,{"$f":"'Computo-Massimali'!$AC$14*J27/$I$7","v":0},0,{"$f":"IF(L27>0,L27/'Computo-Massimali'!L27,\"\")","v":""},0,null,null,{"$f":"'Computo-Massimali'!U27","v":30000}]
[null,null,{"$f":"'Computo-Massimali'!C28","v":"Sistemi di Building Automation"},null,null,null,0,0,{"$f":"H28*'Computo-Massimali'!$G$9","v":0},0,{"$f":"'Computo-Massimali'!$AC$14*J28/$I$7","v":0},0,{"$f":"IF(L28>0,L28/'Computo-Massimali'!L28,\"\")","v":""},0,null,null,{"$f":"'Computo-Massimali'!U28","v":15000}]
[null,null,{"$f":"'Computo-Massimali'!C29","v":"Colonnine di Ricarica"},null,null,null,0,0,{"$f":"H29*'Computo-Massimali'!$G$9","v":0},0,{"$f":"'Computo-Massimali'!$AC$14*J29/$I$7","v":0},0,{"$f":"IF(L29>0,L29/'Computo-Massimali'!L29,\"\")","v":""},0,null,null,{"$f":"'Computo-Massimali'!U29","v":2000}]
[null,null,{"$f":"'Computo-Massimali'!C30","v":"SismaBonus"},null,null,null,0,0,{"$f":"H30*'Computo-Massimali'!$G$9","v":0},0,{"$f":"'Computo-Massimali'!$AC$14*J30/$I$7","v":0},0,{"$f":"IF(L30>0,L30/'Computo-Massimali'!L30,\"\")","v":""},0,null,null,{"$f":"'Computo-Massimali'!U30","v":96000}]
[null,null,null,null,{"$f":"SUM(E19:F30)","v":6500},null,{"$f":"SUM(G19:G30)","v":0},6500,650,7150,1457.6604661666136,{"$f":"SUM(L19:L30)","v":0},null,{"$f":"SUM(N19:N30)","v":88000}]
[]
[null,null,{"$f":"'Computo-Massimali'!C33","v":"Lavori Ristrutturazione"},{"$f":"'Computo-Massimali'!E33","v":0.5},null,null,{"$f":"$E$13*E33/$E$9","v":0},{"$f":"SUM(E33:G33)","v":0},{"$f":"H33*'Computo-Massimali'!$G$9","v":0},{"$f":"SUM(H33:I33)","v":0},{"$f":"'Computo-Massimali'!$AC$14*J33/$I$7","v":0},{"$f":"SUM(J33:K33)","v":0},{"$f":"IF(L33>0,L33/'Computo-Massimali'!L33,\"\")","v":""},{"$f":"IF(L33<=Q33*D33,L33*D33,U33*D33)","v":0},null,null,{"$f":"'Computo-Massimali'!U33","v":96000}]
[null,null,{"$f":"'Computo-Massimali'!C34","v":"-"},{"$f":"'Computo-Massimali'!E34","v":0},null,null,0,0,{"$f":"H34*'Computo-Massimali'!$G$9","v":0},0,{"$f":"'Computo-Massimali'!$AC$14*J34/$I$7","v":0},0,{"$f":"IF(L34>0,L34/'Computo-Massimali'!L34,\"\")","v":""},{"$f":"IF(L34<=Q34*D34,L34*D34,U34*D34)","v":0},null,null,{"$f":"'Computo-Massimali'!U34","v":96000}]
[null,null,null,null,{"$f":"SUM(E33:F34)","v":0},null,{"$f":"SUM(G33:G34)","v":0},{"$f":"SUM(H33:H34)","v":0},{"$f":"SUM(I33:I34)","v":0},{"$f":"SUM(J33:J34)","v":0},0,0,null,{"$f":"SUM(N33:N34)","v":0}]
[]
[]
[null,null,null,null,{"$f":"E15","v":"Importo Lavori Eseguiti  "},null,"Incidenza Sicurezza","Imponibile",{"$f":"I15","v":"Iva"},"Importo c.iva","Spese tecniche","Totale","% SAL","Detrazione "]
[null,null,"Totali SAL N.1",null,{"$f":"E31+E35","v":6500},null,{"$f":"G31+G35","v":0},{"$f":"H31+H35","v":6500},{"$f":"I35+I31","v":650},{"$f":"J35+J31","v":7150},{"$f":"K35+K31","v":1457.6604661666136},{"$f":"SUM(J39:K39)","v":8607.6604661666133},{"$f":"E39/E9","v":5.1250431686328438E-2},{"$f":"N35+N31","v":88000},null,{"$f":"IF(M39>=30%,\"V.\",\"\")","v":""}]
[]
[null,null,null,null,null,null,null,null,null,null,{"$f":"IF(M39>=30%,\"\",\"SAL inferiore 30%\")","v":"SAL inferiore 30%"}]

{"sheet":"Enea SAL 30%","index":3,"n_rows":91,"n_cols":30,"rows_kept":91,"cut":false,"hidden":false,"merged":[[5,6,5,11],[6,6,6,11],[7,6,7,11],[9,2,9,6],[1,2,1,11],[4,2,4,11],[2,2,2,5],[19,1,19,5],[18,1,18,5],[20,1,20,5],[21,1,21,5],[22,1,22,5],[23,1,23,5],[10,2,10,5],[10,6,10,10],[11,6,11,11],[12,2,12,6],[14,9,14,10],[14,1,14,6],[29,9,29,10],[30,1,30,8],[30,9,30,10],[31,1,31,8],[31,9,31,10],[32,1,32,8],[32,9,32,10],[33,1,33,8],[24,1,24,5],[26,1,26,5],[27,1,27,5],[25,1,25,5],[29,1,29,8],[62,1,62,5],[63,1,63,5],[61,1,61,5],[60,1,60,5],[54,9,54,16],[54,17,54,18],[1,12,1,19],[49,1,49,5],[47,1,47,5],[50,1,50,5],[51,1,51,5],[49,9,49,15],[43,1,43,5],[44,1,44,5],[45,1,45,5],[46,1,46,5],[33,9,33,10],[34,1,34,8],[34,9,34,10],[40,1,40,5],[41,1,41,5],[42,1,42,5],[35,1,35,8],[35,9,35,10],[50,16,50,18],[49,16,49,18],[50,9,50,15],[51,9,51,15],[52,9,52,15],[53,9,53,15],[70,1,70,8],[70,9,70,10],[71,1,71,8],[71,9,71,10],[67,1,67,8],[67,9,67,10],[68,1,68,8],[68,9,68,10],[69,1,69,8],[69,9,69,10],[64,1,64,5],[66,1,66,8],[66,9,66,10],[63,7,63,8],[64,7,64,8],[57,1,57,5],[58,1,58,5],[59,1,59,5],[80,1,80,5],[80,7,80,8],[81,1,81,5],[81,7,81,8],[78,1,78,5],[78,7,78,8],[79,1,79,5],[79,7,79,8],[63,12,63,13],[64,12,64,13],[76,1,76,5],[76,7,76,8],[77,1,77,5],[77,7,77,8],[72,1,72,8],[72,9,72,10],[90,1,90,8],[90,9,90,10],[76,13,76,14],[77,13,77,14],[78,13,78,14],[79,13,79,14],[80,13,80,14],[81,13,81,14],[82,13,82,14],[83,13,83,14],[87,1,87,8],[87,9,87,10],[88,1,88,8],[88,9,88,10],[89,1,89,8],[89,9,89,10],[85,1,85,8],[85,9,85,10],[86,1,86,8],[86,9,86,10],[82,1,82,5],[82,7,82,8],[83,1,83,5],[83,7,83,8],[82,16,82,17],[83,16,83,17],[14,7,14,8],[76,16,76,17],[77,16,77,17],[78,16,78,17],[79,16,79,17],[80,16,80,17],[81,16,81,17],[57,12,57,13],[58,12,58,13],[59,12,59,13],[60,12,60,13],[61,12,61,13],[62,12,62,13],[57,7,57,8],[58,7,58,8],[59,7,59,8],[60,7,60,8],[61,7,61,8],[62,7,62,8],[53,16,53,18],[52,16,52,18],[51,16,51,18]]}
[]
[null,"Tipologia Edificio",{"$f":"'Dati Gen'!B4","v":"Edificio Unifamiliare"},null,null,null,null,null,null,null,null,null,"https://detrazionifiscali.enea.it/creaasseverazione.asp"]
[null,"Data Inizio Lavori",{"$f":"'Dati Gen'!C30","v":"2021-03-15"}]
[]
[null,"Comune Ubicazione",{"$f":"'Dati Gen'!C7","v":"ROMA"}]
[null,"Comune Montano","X","SI",null,"NO","Elenco Comuni Montani"]
[null,"Interessato Infrazione",null,"SI","X","NO","Elenco Comuni Infrazioni"]
[null,"Intervento comma 4-Ter",null,"SI","X","NO","160% Zone Terremotate"]
[]
[null,"Indirizzo",{"$f":"'Dati Gen'!C8","v":"Via Vitaliano"},null,null,null,null,null,"N.Civico ",{"$f":"'Dati Gen'!K8","v":23},"CAP",{"$f":"'Dati Gen'!K7","v":0}]
[null,"Anno di Costruzione Immobile",{"$f":"'Dati Gen'!C10","v":0},null,null,null,{"$f":"'Dati Gen'!F10","v":"Superficie Totale Disperdente   :"},null,null,null,null,{"$f":"'Dati Gen'!K10","v":0}]
[null,"Edificio in area Metanizzata","X","SI",null,"NO"]
[null,"Autorizzazione Edilizia",{"$f":"'Dati Gen'!C11","v":"Edificio Storico senza Titolo Edilizio"},null,null,null,null,null,{"$f":"'Dati Gen'!H11","v":""},{"$f":"IF('Dati Gen'!I11<>\"\",'Dati Gen'!I11,\"\")","v":""},{"$f":"'Dati Gen'!J11","v":""},{"$f":"IF('Dati Gen'!I13<>\"\",'Dati Gen'!I13,\"\")","v":""}]
[]
[null,{"$f":"'Dati Gen'!B32","v":"Relazione ex Legge 10/91  Depositata al Comune in Data "},null,null,null,null,null,{"$f":"IF('Dati Gen'!G32<>\"\",'Dati Gen'!G32,\"\")","v":44270},null,"Prot. N.",null,{"$f":"IF('Dati Gen'!K32<>\"\",'Dati Gen'!K32,\"\")","v":25658}]
[]
[]
[null,"intervento di isolamento termico delle superfici opache verticali, orizzontali e inclinate "]
[null,"Descrizione",null,null,null,null,"Superficie mq","Trasm. Ante","Trasm. Post","Trasm.P. YIE","Confine","Coiben-tazione","Realizzati mq"]
[null,"Pareti Verticali Mattoni Pieni 30cm",null,null,null,null,50,3,1.26,0.03,"Esterno","Esterna",30]
[null,"Pareti Verticali Pietrame 50cm",null,null,null,null,20,null,null,null,"-","-"]
[null,"Coperture Legno",null,null,null,null,null,null,null,null,"-","-"]
[null,"Coperture Acciaio",null,null,null,null,null,null,null,null,"-","-"]
[null,"Pavimenti",null,null,null,null,null,null,null,null,"-","-"]
[null,null,null,null,null,null,null,null,null,null,"-","-"]
[null,null,null,null,null,null,null,null,null,null,"-","-"]
[null,null,null,null,null,null,null,null,null,null,"-","-"]
[null,null,null,null,null,null,null,null,null,null,"-","-"]
[]
[null,"Superficie Totale disperdente oggetto di intervento                              [mq]",null,null,null,null,null,null,null,{"$f":"SUM(G20:G28)","v":70}]
[null,"Spesa Massima Ammissibile ",null,null,null,null,null,null,null,{"$f":"'SAL.30%'!Q19","v":50000}]
[null,"Costo Complessivo Previsto in progetto",null,null,null,null,null,null,null,{"$f":"'Computo-Massimali'!L19","v":48998.642572225901}]
[null,"Spesa Ammessa",null,null,null,null,null,null,null,{"$f":"IF(J32<J31,J32,J31)","v":48998.642572225901}]
[null,"Costo Lavori Realizzati",null,null,null,null,null,null,null,{"$f":"'SAL.30%'!L19","v":"Versione DEMO"}]
[null,"di cui ammessi",null,null,null,null,null,null,null,{"$f":"IF(J34<J33,J34,J33)","v":48998.642572225901}]
[null,"Risparmio di energia primaria non rinnovabile di progetto    [kWh/anno]"]
[]
[]
[]
[null,"Intervento di sostituzione degli impianti di climatizzazione invernale esistenti"]
[null,"Descrizione",null,null,null,null,"Tipo Sostituito","P.Nom Sostituito","P.Nom Nuova","Rendim Nomin.","Destinata","Efficienza  Riscaldam. hs","Efficienza  ACS hw","Tipo Aliment.","Classe Dispositivo Termoreg. Evoluto","Tipo PDC","Pot. Elettr. Assorb","COP","Superfic. Risc. Da PDC",null,null,null,null,null,null,null,null,null,null,"Tipo Sostituito"]
[null,"Caldaia a Condensazione",null,null,null,null,"-",24,26,0.03,"-",0,null,"-","-","Salamoia/Acqua",null,null,null,null,null,null,null,null,null,null,null,null,null,"-"]
[null,"Pompe calore PDC compr. vapore el. sonde geot.",null,null,null,null,"-",null,null,null,"-",null,null,"-","-","-",null,null,null,null,null,null,null,null,null,null,null,null,null,"Caldaia Standard"]
[null,"Coperture Legno",null,null,null,null,"-",null,null,null,"-",null,null,"-","-","-",null,null,null,null,null,null,null,null,null,null,null,null,null,"Caldaia Bassa Temp."]
[null,"Coperture Acciaio",null,null,null,null,"-",null,null,null,"-",null,null,"-","-","-",null,null,null,null,null,null,null,null,null,null,null,null,null,"Caldaia Condens. Gas"]
[null,"Pavimenti",null,null,null,null,"-",null,null,null,"-",null,null,"-","-","-",null,null,null,null,null,null,null,null,null,null,null,null,null,"Caldaia Condens.Gasolio"]
[null,null,null,null,null,null,"-",null,null,null,"-",null,null,"-","-","-",null,null,null,null,null,null,null,null,null,null,null,null,null,"Teleriscaldamento"]
[null,null,null,null,null,null,"-",null,null,null,"-",null,null,"-","-","-",null,null,null,null,null,null,null,null,null,null,null,null,null,"Impianto biomassa"]
[null,null,null,null,null,null,null,null,null,null,null,null,null,null,null,null,null,null,null,null,null,null,null,null,null,null,null,null,null,"Altro"]
[null,"Destinati a :   Climatizzazione Invernale",null,null,null,null,"X",null,null,"Spesa Massima Ammissibile ",null,null,null,null,null,null,{"$f":"'Computo-Massimali'!U26","v":30000}]
[null,"                         Climatizzazione estiva",null,null,null,null,null,null,null,"Costo Complessivo Previsto in progetto",null,null,null,null,null,null,{"$f":"'Computo-Massimali'!L26","v":30039.249791238235}]
[null,"                         prod. di acqua calda sanitaria",null,null,null,null,null,null,null,"Spesa Ammessa",null,null,null,null,null,null,{"$f":"IF(Q51<Q50,Q51,Q50)","v":30000}]
[null,null,null,null,null,null,null,null,null,"Costo Lavori Realizzati",null,null,null,null,null,null,{"$f":"'SAL.30%'!L26","v":"Versione DEMO"}]
[null,null,null,null,null,null,null,null,null,"di cui ammessi",null,null,null,null,null,null,{"$f":"IF(Q53<Q52,Q53,Q52)","v":30000}]
[null,null,null,null,null,null,null,null,null,"Risparmio di energia primaria non rinnovabile di progetto    [kWh/anno]"]
[]
[null,"Sostituzione degli infissi "]
[null,"Descrizione",null,null,null,null,"Telaio Prima","Vetro Prima",null,"Trasm. Ante","Superfice mq","Telaio Dopo","Vetro Dopo",null,"Trasm. Post","Chius. Oscura"]
[null,"Infissi in Legno 1 Anta Vetro Singolo con 1A2V",null,null,null,null,"Legno","Singolo",null,3.5,5,"Legno","Singolo",null,1.3,"x",null,null,null,null,null,null,null,null,null,null,null,null,{"$f":"IF(P59<>\"\",1,0)","v":1}]
[null,"Portoni Ingresso",null,null,null,null,"Legno","Nessuno",null,3.5,4,"Legno","Nessuno",null,1.3,null,null,null,null,null,null,null,null,null,null,null,null,null,{"$f":"IF(P60<>\"\",1,0)","v":0}]
[null,null,null,null,null,null,"-","-",null,null,null,"-","-",null,null,null,null,null,null,null,null,null,null,null,null,null,null,null,0]
[null,null,null,null,null,null,"-","-",null,null,null,"-","-",null,null,null,null,null,null,null,null,null,null,null,null,null,null,null,0]
[null,null,null,null,null,null,"-","-",null,null,null,"-","-",null,null,null,null,null,null,null,null,null,null,null,null,null,null,null,0]
[null,null,null,null,null,null,"-","-",null,null,null,"-","-",null,null,null,null,null,null,null,null,null,null,null,null,null,null,null,0]
[null,null,null,null,null,null,"-","-",null,null,null,"-","-",null,null,null,null,null,null,null,null,null,null,null,null,null,null,null,0]
[null,null,null,null,null,null,null,null,null,null,null,null,null,null,null,null,null,null,null,null,null,null,null,null,null,null,null,null,{"$f":"SUM(AC59:AC65)","v":1}]
[null,"Superficie Totale disperdente oggetto di intervento                              [mq]",null,null,null,null,null,null,null,{"$f":"SUM(K59:K65)","v":9}]
[null,"Spesa Massima Ammissibile ",null,null,null,null,null,null,null,{"$f":"IF(AC66>0,'Computo-Massimali'!U21,'Computo-Massimali'!U20)","v":54545.454545454544}]
[null,"Costo Complessivo Previsto in progetto",null,null,null,null,null,null,null,{"$f":"IF(AC66>0,'Computo-Massimali'!L21,'Computo-Massimali'!L20)","v":16309.379328058363}]
[null,"Spesa Ammessa",null,null,null,null,null,null,null,{"$f":"IF(J69<J68,J69,J68)","v":16309.379328058363}]
[null,"Costo Lavori Realizzati",null,null,null,null,null,null,null,{"$f":"IF(AC66>0,'SAL.30%'!L21,'SAL.30%'!L20)","v":0}]
[null,"di cui ammessi",null,null,null,null,null,null,null,{"$f":"IF(J71<J70,J71,J70)","v":0}]
[null,"Risparmio di energia primaria non rinnovabile di progetto    [kWh/anno]"]
[]
[]
[null,"Schermature solari e chiusure oscuranti"]
[null,"Descrizione",null,null,null,null,"Tipo Schermatura","Installazione",null,"Superf. Schermatura","Superfice finestra protetta","Resistenza term. suppl m2K/W","Orientamento","Tipo Calcolo",null,"gtot","Materiale schermatura",null,"Meccan. Regolaz."]
[null,"Persiane",null,null,null,null,"-","-",null,3.5,5,0.08,"-","-",null,null,"-",null,"-"]
[null,"Sportelli Legno",null,null,null,null,"-","-",null,3.5,4,null,"-","-",null,null,"-",null,"-"]
[null,null,null,null,null,null,"-","-",null,null,null,null,"-","-",null,null,"-",null,"-"]
[null,null,null,null,null,null,"-","-",null,null,null,null,"-","-",null,null,"-",null,"-"]
[null,null,null,null,null,null,"-","-",null,null,null,null,"-","-",null,null,"-",null,"-"]
[null,null,null,null,null,null,"-","-",null,null,null,null,"-","-",null,null,"-",null,"-"]
[null,null,null,null,null,null,"-","-",null,null,null,null,"-","-",null,null,"-",null,"-"]
[]
[null,"Spesa Massima Ammissibile ",null,null,null,null,null,null,null,{"$f":"'Computo-Massimali'!U22","v":54545.454545454544}]
[null,"Costo Complessivo Previsto in progetto",null,null,null,null,null,null,null,{"$f":"'Computo-Massimali'!L22","v":0}]
[null,"Spesa Ammessa",null,null,null,null,null,null,null,{"$f":"IF(J87<J86,J87,J86)","v":0}]
[null,"Costo Lavori Realizzati",null,null,null,null,null,null,null,{"$f":"'SAL.30%'!L22","v":0}]
[null,"di cui ammessi",null,null,null,null,null,null,null,{"$f":"IF(J89<J88,J89,J88)","v":0}]
[null,"Risparmio di energia primaria non rinnovabile di progetto    [kWh/anno]"]

{"sheet":"SAL.60%","index":4,"n_rows":41,"n_cols":21,"rows_kept":41,"cut":false,"hidden":false,"merged":[[5,2,5,3],[5,4,5,5],[2,2,2,3],[2,5,2,8],[3,2,3,3],[3,5,3,8],[4,2,4,4],[6,2,6,3],[6,4,6,5],[7,2,7,3],[7,4,7,5],[8,2,8,3],[8,4,8,5],[9,2,9,3],[9,4,9,5],[12,2,12,3],[12,4,12,5],[14,2,14,3],[14,4,14,5],[15,2,15,3],[15,4,15,5],[16,2,16,3],[16,4,16,5],[17,2,17,3],[17,4,17,5],[24,4,24,5],[18,2,18,3],[18,4,18,5],[19,2,19,3],[19,4,19,5],[20,2,20,3],[20,4,20,5],[21,2,21,3],[21,4,21,5],[22,2,22,3],[22,4,22,5],[23,4,23,5],[32,4,32,5],[25,2,25,3],[25,4,25,5],[26,2,26,3],[26,4,26,5],[27,2,27,3],[27,4,27,5],[28,2,28,3],[28,4,28,5],[29,2,29,3],[29,4,29,5],[30,4,30,5],[38,15,38,18],[40,10,40,13],[33,4,33,5],[34,4,34,5],[37,2,37,3],[37,4,37,5],[38,2,38,3],[38,4,38,5]]}
[]
[]
[null,null,"STATO AVANZAMENTO LAVORI N.2",null,null,{"$f":"'Dati Gen'!B27","v":"Rossi Mario"},null,null,null,null,null,null,null,{"$f":"'Dati Gen'!I2","v":"©2021 SIM srl - www.madosoft.it"}]
[null,null,"Data 27/03/2021",null,null,{"$f":"'Dati Gen'!B28","v":"Via Vitaliano, 23"},null,null,null,null,null,null,null,{"$f":"'Dati Gen'!I1","v":"Pratica.110"}]
[]
[null,null,null,null,"Imponibile",null,"%iva","IVA","Importo"]
[null,null,"Importo complessivo Lavori",null,{"$f":"'Computo-Massimali'!F7","v":134860.28},null,{"$f":"'Computo-Massimali'!G7","v":0.1},{"$f":"'Computo-Massimali'!H7","v":13486.028},{"$f":"'Computo-Massimali'!I7","v":148346.30799999999}]
[null,null,"di cui Oneri/Lavori x Sicurezza",null,{"$f":"'Computo-Massimali'!F8","v":8032.08},null,{"$f":"'Computo-Massimali'!G8","v":0.1},{"$f":"'Computo-Massimali'!H8","v":803.20800000000008},{"$f":"'Computo-Massimali'!I8","v":8835.2880000000005}]
[null,null,"Importo b.a.",null,{"$f":"'Computo-Massimali'!F9","v":126828.2},null,{"$f":"'Computo-Massimali'!G9","v":0.1},{"$f":"'Computo-Massimali'!H9","v":12682.82},{"$f":"'Computo-Massimali'!I9","v":139511.01999999999}]
[null,null,"Spese tecniche (compresa iva)",null,{"$f":"'Computo-Massimali'!F10","v":30243.153632640002},null,{"$f":"'Computo-Massimali'!G10","v":0},{"$f":"'Computo-Massimali'!H10","v":0},{"$f":"'Computo-Massimali'!I10","v":30243.153632640002}]
[null,null,null,null,null,null,null,null,{"$f":"'Computo-Massimali'!I11","v":178589.46163263998}]
[null,null,"Lavori Eseguiti"]
[null,null,"Oneri/Lavori x Sicurezza"]
[]
[null,null,"Lavorazione",null,"Importo Lavori Eseguiti  ",null,"Incidenza Sicurezza","Imponibile","Iva","Importo c.iva","Spese tecniche","Totale","% SAL","Detrazione ",null,null,{"$f":"'Computo-Massimali'!U15","v":"Massimale spesa"},null,"Ripartizione Spese Tecniche",null,"Fatturare"]
[null,null,{"$f":"'Computo-Massimali'!C16","v":"Isolamento pareti perimetrali"},null,null,null,{"$f":"$E$13*E16/$E$9","v":0},{"$f":"SUM(E16:G16)","v":0},{"$f":"H16*'Computo-Massimali'!$G$9","v":0},{"$f":"SUM(H16:I16)","v":0},{"$f":"'Computo-Massimali'!$AC$14*J16/$I$7","v":0},{"$f":"SUM(J16:K16)","v":0},{"$f":"IF(L16>0,L16/'Computo-Massimali'!L16,\"\")","v":""},{"$f":"IF(L16<=Q16,L16*1.1,Q16*1.1)","v":0},null,null,{"$f":"'Computo-Massimali'!U16","v":50000},null,{"$f":"IF('Computo-Massimali'!T3<>0,'Computo-Massimali'!T3,\"-\")","v":"Ape Ante"},{"$f":"$K$39*'Computo-Massimali'!AC3/'Computo-Massimali'!$AC$14","v":0},{"$f":"IF(T16>0,T16-'SAL.30%'!T16,\"0\")","v":"0"}]
[null,null,{"$f":"'Computo-Massimali'!C17","v":"Isolamento coperture"},null,null,null,{"$f":"$E$13*E17/$E$9","v":0},{"$f":"SUM(E17:G17)","v":0},{"$f":"H17*'Computo-Massimali'!$G$9","v":0},{"$f":"SUM(H17:I17)","v":0},{"$f":"'Computo-Massimali'!$AC$14*J17/$I$7","v":0},{"$f":"SUM(J17:K17)","v":0},{"$f":"IF(L17>0,L17/'Computo-Massimali'!L17,\"\")","v":""},0,null,null,{"$f":"'Computo-Massimali'!U17","v":50000},null,{"$f":"IF('Computo-Massimali'!T4<>0,'Computo-Massimali'!T4,\"-\")","v":"Progettazione e DL"},{"$f":"$K$39*'Computo-Massimali'!AC4/'Computo-Massimali'!$AC$14","v":0},{"$f":"IF(T17>0,T17-'SAL.30%'!T17,\"0\")","v":"0"}]
[null,null,{"$f":"'Computo-Massimali'!C18","v":"Isolamento Pavimenti"},null,null,null,{"$f":"$E$13*E18/$E$9","v":0},0,{"$f":"H18*'Computo-Massimali'!$G$9","v":0},0,{"$f":"'Computo-Massimali'!$AC$14*J18/$I$7","v":0},0,{"$f":"IF(L18>0,L18/'Computo-Massimali'!L18,\"\")","v":""},0,null,null,{"$f":"'Computo-Massimali'!U18","v":50000},null,{"$f":"IF('Computo-Massimali'!T5<>0,'Computo-Massimali'!T5,\"-\")","v":"Coord.SicurezzaEsec."},{"$f":"$K$39*'Computo-Massimali'!AC5/'Computo-Massimali'!$AC$14","v":0},{"$f":"IF(T18>0,T18-'SAL.30%'!T18,\"0\")","v":"0"}]
[null,null,{"$f":"'Computo-Massimali'!C19","v":"Isolamento sup. verticali e/o orizzontali"},null,{"$f":"SUM(E16:F18)","v":0},null,{"$f":"SUM(G16:G18)","v":0},{"$f":"SUM(H16:H18)","v":0},{"$f":"SUM(I16:I18)","v":0},{"$f":"SUM(J16:J18)","v":0},{"$f":"SUM(K16:K18)","v":0},{"$f":"IF('Dati Gen'!P17=\"Versione DEMO\",\"Versione DEMO\",SUM(J19:K19))","v":"Versione DEMO"},{"$f":"IF(L19>0,L19/'Computo-Massimali'!L19,\"\")","v":{"$error":"#VALUE!"}},55000.000000000007,null,null,{"$f":"'Computo-Massimali'!U19","v":50000},null,{"$f":"IF('Computo-Massimali'!T6<>0,'Computo-Massimali'!T6,\"-\")","v":"Ape Post"},{"$f":"$K$39*'Computo-Massimali'!AC6/'Computo-Massimali'!$AC$14","v":0},{"$f":"IF(T19>0,T19-'SAL.30%'!T19,\"0\")","v":"0"}]
[null,null,{"$f":"'Computo-Massimali'!C20","v":"Serramenti"},null,null,null,{"$f":"$E$13*E20/$E$9","v":0},0,{"$f":"H20*'Computo-Massimali'!$G$9","v":0},0,{"$f":"'Computo-Massimali'!$AC$14*J20/$I$7","v":0},0,{"$f":"IF(L20>0,L20/'Computo-Massimali'!L20,\"\")","v":""},0,null,null,{"$f":"'Computo-Massimali'!U20","v":54545.454545454544},null,{"$f":"IF('Computo-Massimali'!T7<>0,'Computo-Massimali'!T7,\"-\")","v":"-"},{"$f":"$K$39*'Computo-Massimali'!AC7/'Computo-Massimali'!$AC$14","v":0},{"$f":"IF(T20>0,T20-'SAL.30%'!T20,\"0\")","v":"0"}]
[null,null,{"$f":"'Computo-Massimali'!C21","v":"Serramenti + chiusure oscuranti"},null,null,null,0,0,{"$f":"H21*'Computo-Massimali'!$G$9","v":0},0,{"$f":"'Computo-Massimali'!$AC$14*J21/$I$7","v":0},0,{"$f":"IF(L21>0,L21/'Computo-Massimali'!L21,\"\")","v":""},0,null,null,{"$f":"'Computo-Massimali'!U21","v":54545.454545454544},null,{"$f":"IF('Computo-Massimali'!T8<>0,'Computo-Massimali'!T8,\"-\")","v":"-"},{"$f":"$K$39*'Computo-Massimali'!AC8/'Computo-Massimali'!$AC$14","v":0},{"$f":"IF(T21>0,T21-'SAL.30%'!T21,\"0\")","v":"0"}]
[null,null,{"$f":"'Computo-Massimali'!C22","v":"Schermature solari e chiusure Oscuranti"},null,null,null,0,0,{"$f":"H22*'Computo-Massimali'!$G$9","v":0},0,{"$f":"'Computo-Massimali'!$AC$14*J22/$I$7","v":0},0,{"$f":"IF(L22>0,L22/'Computo-Massimali'!L22,\"\")","v":""},0,null,null,{"$f":"'Computo-Massimali'!U22","v":54545.454545454544},null,{"$f":"IF('Computo-Massimali'!T9<>0,'Computo-Massimali'!T9,\"-\")","v":"-"},{"$f":"$K$39*'Computo-Massimali'!AC9/'Computo-Massimali'!$AC$14","v":0},{"$f":"IF(T22>0,T22-'SAL.30%'!T22,\"0\")","v":"0"}]
[null,null,{"$f":"'Computo-Massimali'!C23","v":"Solare Termico    - con collettori solari"},null,null,null,0,0,{"$f":"H23*'Computo-Massimali'!$G$9","v":0},0,{"$f":"'Computo-Massimali'!$AC$14*J23/$I$7","v":0},0,{"$f":"IF(L23>0,L23/'Computo-Massimali'!L23,\"\")","v":""},0,null,null,{"$f":"'Computo-Massimali'!U23","v":30000},null,{"$f":"IF('Computo-Massimali'!T10<>0,'Computo-Massimali'!T10,\"-\")","v":"-"},{"$f":"$K$39*'Computo-Massimali'!AC10/'Computo-Massimali'!$AC$14","v":0},{"$f":"IF(T23>0,T23-'SAL.30%'!T23,\"0\")","v":"0"}]
[null,null,{"$f":"'Computo-Massimali'!C24","v":"Solare Fotovoltaico              kWp"},{"$f":"'Computo-Massimali'!D24","v":6},null,null,0,0,{"$f":"H24*'Computo-Massimali'!$G$9","v":0},0,{"$f":"'Computo-Massimali'!$AC$14*J24/$I$7","v":0},0,{"$f":"IF(L24>0,L24/'Computo-Massimali'!L24,\"\")","v":""},0,null,null,{"$f":"'Computo-Massimali'!U24","v":14400},null,{"$f":"IF('Computo-Massimali'!T13<>0,'Computo-Massimali'!T13,\"-\")","v":"Visto Conformità"},{"$f":"$K$39*'Computo-Massimali'!AC13/'Computo-Massimali'!$AC$14","v":0},{"$f":"IF(T24>0,T24-'SAL.30%'!T24,\"0\")","v":"0"}]
[null,null,{"$f":"'Computo-Massimali'!C25","v":"Sistema di Accumulo           kWh"},{"$f":"'Computo-Massimali'!D25","v":10},null,null,0,0,{"$f":"H25*'Computo-Massimali'!$G$9","v":0},0,{"$f":"'Computo-Massimali'!$AC$14*J25/$I$7","v":0},0,{"$f":"IF(L25>0,L25/'Computo-Massimali'!L25,\"\")","v":""},0,null,null,{"$f":"'Computo-Massimali'!U25","v":10000},null,null,{"$f":"SUM(T16:T24)","v":0},{"$f":"SUM(U16:U24)","v":0}]
[null,null,{"$f":"'Computo-Massimali'!C26","v":"Impianti climatizzazione e ACS"},null,null,null,0,0,{"$f":"H26*'Computo-Massimali'!$G$9","v":0},0,{"$f":"'Computo-Massimali'!$AC$14*J26/$I$7","v":0},{"$f":"IF('Dati Gen'!P17=\"Versione DEMO\",\"Versione DEMO\",SUM(J26:K26))","v":"Versione DEMO"},{"$f":"IF(L26>0,L26/'Computo-Massimali'!L26,\"\")","v":{"$error":"#VALUE!"}},33000,null,null,{"$f":"'Computo-Massimali'!U26","v":30000}]
[null,null,{"$f":"'Computo-Massimali'!C27","v":"Impianti Biomassa"},null,null,null,0,0,{"$f":"H27*'Computo-Massimali'!$G$9","v":0},0,{"$f":"'Computo-Massimali'!$AC$14*J27/$I$7","v":0},0,{"$f":"IF(L27>0,L27/'Computo-Massimali'!L27,\"\")","v":""},0,null,null,{"$f":"'Computo-Massimali'!U27","v":30000}]
[null,null,{"$f":"'Computo-Massimali'!C28","v":"Sistemi di Building Automation"},null,null,null,0,0,{"$f":"H28*'Computo-Massimali'!$G$9","v":0},0,{"$f":"'Computo-Massimali'!$AC$14*J28/$I$7","v":0},0,{"$f":"IF(L28>0,L28/'Computo-Massimali'!L28,\"\")","v":""},0,null,null,{"$f":"'Computo-Massimali'!U28","v":15000}]
[null,null,{"$f":"'Computo-Massimali'!C29","v":"Colonnine di Ricarica"},null,null,null,0,0,{"$f":"H29*'Computo-Massimali'!$G$9","v":0},0,{"$f":"'Computo-Massimali'!$AC$14*J29/$I$7","v":0},0,{"$f":"IF(L29>0,L29/'Computo-Massimali'!L29,\"\")","v":""},0,null,null,{"$f":"'Computo-Massimali'!U29","v":2000}]
[null,null,{"$f":"'Computo-Massimali'!C30","v":"SismaBonus"},null,null,null,0,0,{"$f":"H30*'Computo-Massimali'!$G$9","v":0},0,{"$f":"'Computo-Massimali'!$AC$11*J30/$I$7","v":0},0,{"$f":"IF(L30>0,L30/'Computo-Massimali'!L30,\"\")","v":""},0,null,null,{"$f":"'Computo-Massimali'!U30","v":96000}]
[null,null,null,null,{"$f":"SUM(E19:F30)","v":0},null,{"$f":"SUM(G19:G30)","v":0},0,0,0,0,0,null,{"$f":"SUM(N19:N30)","v":88000}]
[]
[null,null,{"$f":"'Computo-Massimali'!C33","v":"Lavori Ristrutturazione"},{"$f":"'Computo-Massimali'!E33","v":0.5},null,null,{"$f":"$E$13*E33/$E$9","v":0},{"$f":"SUM(E33:G33)","v":0},{"$f":"H33*'Computo-Massimali'!$G$9","v":0},{"$f":"SUM(H33:I33)","v":0},{"$f":"'Computo-Massimali'!$AC$14*J33/$I$7","v":0},{"$f":"SUM(J33:K33)","v":0},{"$f":"IF(L33>0,L33/'Computo-Massimali'!L33,\"\")","v":""},{"$f":"IF(L33<=Q33*D33,L33*D33,U33*D33)","v":0},null,null,{"$f":"'Computo-Massimali'!U33","v":96000}]
[null,null,{"$f":"'Computo-Massimali'!C34","v":"-"},{"$f":"'Computo-Massimali'!E34","v":0},null,null,0,0,{"$f":"H34*'Computo-Massimali'!$G$9","v":0},0,{"$f":"'Computo-Massimali'!$AC$14*J34/$I$7","v":0},0,{"$f":"IF(L34>0,L34/'Computo-Massimali'!L34,\"\")","v":""},{"$f":"IF(L34<=Q34*D34,L34*D34,U34*D34)","v":0},null,null,{"$f":"'Computo-Massimali'!U34","v":96000}]
[null,null,null,null,{"$f":"SUM(E33:F34)","v":0},null,{"$f":"SUM(G33:G34)","v":0},{"$f":"SUM(H33:H34)","v":0},{"$f":"SUM(I33:I34)","v":0},{"$f":"SUM(J33:J34)","v":0},0,0,null,{"$f":"SUM(N33:N34)","v":0}]
[]
[]
[null,null,null,null,{"$f":"E15","v":"Importo Lavori Eseguiti  "},null,"Incidenza Sicurezza","Imponibile",{"$f":"I15","v":"Iva"},"Importo c.iva","Spese tecniche","Totale","% SAL","Detrazione "]
[null,null,"Totali SAL N.2",null,{"$f":"E31+E35","v":0},null,{"$f":"G31+G35","v":0},{"$f":"H31+H35","v":0},{"$f":"I35+I31","v":0},{"$f":"J35+J31","v":0},{"$f":"K35+K31","v":0},{"$f":"SUM(J39:K39)","v":0},{"$f":"E39/E9","v":0},{"$f":"N35+N31","v":88000},null,{"$f":"IF(M39>=60%,\"V.\",\"\")","v":""}]
[]
[null,null,null,null,null,null,null,null,null,null,{"$f":"IF(M39>=60%,\"\",\"SAL inferiore 60%\")","v":"SAL inferiore 60%"}]

{"sheet":"Enea SAL 60%","index":5,"n_rows":91,"n_cols":30,"rows_kept":91,"cut":false,"hidden":false,"merged":[[1,2,1,11],[1,12,1,19],[2,2,2,5],[4,2,4,11],[5,6,5,11],[6,6,6,11],[14,1,14,6],[14,7,14,8],[14,9,14,10],[18,1,18,5],[19,1,19,5],[20,1,20,5],[7,6,7,11],[9,2,9,6],[10,2,10,5],[10,6,10,10],[11,6,11,11],[12,2,12,6],[27,1,27,5],[29,1,29,8],[29,9,29,10],[30,1,30,8],[30,9,30,10],[31,1,31,8],[31,9,31,10],[21,1,21,5],[22,1,22,5],[23,1,23,5],[24,1,24,5],[25,1,25,5],[26,1,26,5],[35,1,35,8],[35,9,35,10],[40,1,40,5],[41,1,41,5],[42,1,42,5],[43,1,43,5],[32,1,32,8],[32,9,32,10],[33,1,33,8],[33,9,33,10],[34,1,34,8],[34,9,34,10],[49,16,49,18],[50,1,50,5],[50,9,50,15],[50,16,50,18],[51,1,51,5],[51,9,51,15],[51,16,51,18],[44,1,44,5],[45,1,45,5],[46,1,46,5],[47,1,47,5],[49,1,49,5],[49,9,49,15],[57,1,57,5],[57,7,57,8],[57,12,57,13],[58,1,58,5],[58,7,58,8],[58,12,58,13],[52,9,52,15],[52,16,52,18],[53,9,53,15],[53,16,53,18],[54,9,54,16],[54,17,54,18],[61,1,61,5],[61,7,61,8],[61,12,61,13],[62,1,62,5],[62,7,62,8],[62,12,62,13],[59,1,59,5],[59,7,59,8],[59,12,59,13],[60,1,60,5],[60,7,60,8],[60,12,60,13],[66,1,66,8],[66,9,66,10],[67,1,67,8],[67,9,67,10],[68,1,68,8],[68,9,68,10],[63,1,63,5],[63,7,63,8],[63,12,63,13],[64,1,64,5],[64,7,64,8],[64,12,64,13],[72,1,72,8],[72,9,72,10],[76,1,76,5],[76,7,76,8],[76,13,76,14],[76,16,76,17],[69,1,69,8],[69,9,69,10],[70,1,70,8],[70,9,70,10],[71,1,71,8],[71,9,71,10],[79,1,79,5],[79,7,79,8],[79,13,79,14],[79,16,79,17],[80,1,80,5],[80,7,80,8],[80,13,80,14],[80,16,80,17],[77,1,77,5],[77,7,77,8],[77,13,77,14],[77,16,77,17],[78,1,78,5],[78,7,78,8],[78,13,78,14],[78,16,78,17],[83,1,83,5],[83,7,83,8],[83,13,83,14],[83,16,83,17],[85,1,85,8],[85,9,85,10],[81,1,81,5],[81,7,81,8],[81,13,81,14],[81,16,81,17],[82,1,82,5],[82,7,82,8],[82,13,82,14],[82,16,82,17],[89,1,89,8],[89,9,89,10],[90,1,90,8],[90,9,90,10],[86,1,86,8],[86,9,86,10],[87,1,87,8],[87,9,87,10],[88,1,88,8],[88,9,88,10]]}
[]
[null,"Tipologia Edificio",{"$f":"'Dati Gen'!B4","v":"Edificio Unifamiliare"},null,null,null,null,null,null,null,null,null,"https://detrazionifiscali.enea.it/creaasseverazione.asp"]
[null,"Data Inizio Lavori",{"$f":"'Dati Gen'!C30","v":"2021-03-15"}]
[]
[null,"Comune Ubicazione",{"$f":"'Dati Gen'!C7","v":"ROMA"}]
[null,"Comune Montano","X","SI",null,"NO","Elenco Comuni Montani"]
[null,"Interessato Infrazione",null,"SI","X","NO","Elenco Comuni Infrazioni"]
[null,"Intervento comma 4-Ter",null,"SI","X","NO","160% Zone Terremotate"]
[]
[null,"Indirizzo",{"$f":"'Dati Gen'!C8","v":"Via Vitaliano"},null,null,null,null,null,"N.Civico ",{"$f":"'Dati Gen'!K8","v":23},"CAP",{"$f":"'Dati Gen'!K7","v":0}]
[null,"Anno di Costruzione Immobile",{"$f":"'Dati Gen'!C10","v":0},null,null,null,{"$f":"'Dati Gen'!F10","v":"Superficie Totale Disperdente   :"},null,null,null,null,{"$f":"'Dati Gen'!K10","v":0}]
[null,"Edificio in area Metanizzata","X","SI",null,"NO"]
[null,"Autorizzazione Edilizia",{"$f":"'Dati Gen'!C11","v":"Edificio Storico senza Titolo Edilizio"},null,null,null,null,null,{"$f":"'Dati Gen'!H11","v":""},{"$f":"IF('Dati Gen'!I11<>\"\",'Dati Gen'!I11,\"\")","v":""},{"$f":"'Dati Gen'!J11","v":""},{"$f":"IF('Dati Gen'!I13<>\"\",'Dati Gen'!I13,\"\")","v":""}]
[]
[null,{"$f":"'Dati Gen'!B32","v":"Relazione ex Legge 10/91  Depositata al Comune in Data "},null,null,null,null,null,{"$f":"IF('Dati Gen'!G32<>\"\",'Dati Gen'!G32,\"\")","v":44270},null,"Prot. N.",null,{"$f":"IF('Dati Gen'!K32<>\"\",'Dati Gen'!K32,\"\")","v":25658}]
[]
[]
[null,"intervento di isolamento termico delle superfici opache verticali, orizzontali e inclinate "]
[null,"Descrizione",null,null,null,null,"Superficie mq","Trasm. Ante","Trasm. Post","Trasm.P. YIE","Confine","Coiben-tazione","Realizzati mq"]
[null,"Pareti Verticali Mattoni Pieni 30cm",null,null,null,null,50,3,1.26,0.03,"Esterno","Esterna",30]
[null,"Pareti Verticali Pietrame 50cm",null,null,null,null,20,null,null,null,"-","-"]
[null,"Coperture Legno",null,null,null,null,null,null,null,null,"-","-"]
[null,"Coperture Acciaio",null,null,null,null,null,null,null,null,"-","-"]
[null,"Pavimenti",null,null,null,null,null,null,null,null,"-","-"]
[null,null,null,null,null,null,null,null,null,null,"-","-"]
[null,null,null,null,null,null,null,null,null,null,"-","-"]
[null,null,null,null,null,null,null,null,null,null,"-","-"]
[null,null,null,null,null,null,null,null,null,null,"-","-"]
[]
[null,"Superficie Totale disperdente oggetto di intervento                              [mq]",null,null,null,null,null,null,null,{"$f":"SUM(G20:G28)","v":70}]
[null,"Spesa Massima Ammissibile ",null,null,null,null,null,null,null,{"$f":"'SAL.60%'!Q19","v":50000}]
[null,"Costo Complessivo Previsto in progetto",null,null,null,null,null,null,null,{"$f":"'Computo-Massimali'!L19","v":48998.642572225901}]
[null,"Spesa Ammessa",null,null,null,null,null,null,null,{"$f":"IF(J32<J31,J32,J31)","v":48998.642572225901}]
[null,"Costo Lavori Realizzati",null,null,null,null,null,null,null,{"$f":"'SAL.60%'!L19","v":"Versione DEMO"}]
[null,"di cui ammessi",null,null,null,null,null,null,null,{"$f":"IF(J34<J33,J34,J33)","v":48998.642572225901}]
[null,"Risparmio di energia primaria non rinnovabile di progetto    [kWh/anno]"]
[]
[]
[]
[null,"Intervento di sostituzione degli impianti di climatizzazione invernale esistenti"]
[null,"Descrizione",null,null,null,null,"Tipo Sostituito","P.Nom Sostituito","P.Nom Nuova","Rendim Nomin.","Destinata","Efficienza  Riscaldam. hs","Efficienza  ACS hw","Tipo Aliment.","Classe Dispositivo Termoreg. Evoluto","Tipo PDC","Pot. Elettr. Assorb","COP","Superfic. Risc. Da PDC",null,null,null,null,null,null,null,null,null,null,"Tipo Sostituito"]
[null,"Caldaia a Condensazione",null,null,null,null,"-",24,26,0.03,"-",0,null,"-","-","Salamoia/Acqua",null,null,null,null,null,null,null,null,null,null,null,null,null,"-"]
[null,"Pompe calore PDC compr. vapore el. sonde geot.",null,null,null,null,"-",null,null,null,"-",null,null,"-","-","-",null,null,null,null,null,null,null,null,null,null,null,null,null,"Caldaia Standard"]
[null,"Coperture Legno",null,null,null,null,"-",null,null,null,"-",null,null,"-","-","-",null,null,null,null,null,null,null,null,null,null,null,null,null,"Caldaia Bassa Temp."]
[null,"Coperture Acciaio",null,null,null,null,"-",null,null,null,"-",null,null,"-","-","-",null,null,null,null,null,null,null,null,null,null,null,null,null,"Caldaia Condens. Gas"]
[null,"Pavimenti",null,null,null,null,"-",null,null,null,"-",null,null,"-","-","-",null,null,null,null,null,null,null,null,null,null,null,null,null,"Caldaia Condens.Gasolio"]
[null,null,null,null,null,null,"-",null,null,null,"-",null,null,"-","-","-",null,null,null,null,null,null,null,null,null,null,null,null,null,"Teleriscaldamento"]
[null,null,null,null,null,null,"-",null,null,null,"-",null,null,"-","-","-",null,null,null,null,null,null,null,null,null,null,null,null,null,"Impianto biomassa"]
[null,null,null,null,null,null,null,null,null,null,null,null,null,null,null,null,null,null,null,null,null,null,null,null,null,null,null,null,null,"Altro"]
[null,"Destinati a :   Climatizzazione Invernale",null,null,null,null,"X",null,null,"Spesa Massima Ammissibile ",null,null,null,null,null,null,{"$f":"'Computo-Massimali'!U26","v":30000}]
[null,"                         Climatizzazione estiva",null,null,null,null,null,null,null,"Costo Complessivo Previsto in progetto",null,null,null,null,null,null,{"$f":"'Computo-Massimali'!L26","v":30039.249791238235}]
[null,"                         prod. di acqua calda sanitaria",null,null,null,null,null,null,null,"Spesa Ammessa",null,null,null,null,null,null,{"$f":"IF(Q51<Q50,Q51,Q50)","v":30000}]
[null,null,null,null,null,null,null,null,null,"Costo Lavori Realizzati",null,null,null,null,null,null,{"$f":"'SAL.60%'!L26","v":"Versione DEMO"}]
[null,null,null,null,null,null,null,null,null,"di cui ammessi",null,null,null,null,null,null,{"$f":"IF(Q53<Q52,Q53,Q52)","v":30000}]
[null,null,null,null,null,null,null,null,null,"Risparmio di energia primaria non rinnovabile di progetto    [kWh/anno]"]
[]
[null,"Sostituzione degli infissi "]
[null,"Descrizione",null,null,null,null,"Telaio Prima","Vetro Prima",null,"Trasm. Ante","Superfice mq","Telaio Dopo","Vetro Dopo",null,"Trasm. Post","Chius. Oscura"]
[null,"Infissi in Legno 1 Anta Vetro Singolo con 1A2V",null,null,null,null,"Legno","Singolo",null,3.5,5,"Legno","Singolo",null,1.3,"x",null,null,null,null,null,null,null,null,null,null,null,null,{"$f":"IF(P59<>\"\",1,0)","v":1}]
[null,"Portoni Ingresso",null,null,null,null,"Legno","Nessuno",null,3.5,4,"Legno","Nessuno",null,1.3,null,null,null,null,null,null,null,null,null,null,null,null,null,{"$f":"IF(P60<>\"\",1,0)","v":0}]
[null,null,null,null,null,null,"-","-",null,null,null,"-","-",null,null,null,null,null,null,null,null,null,null,null,null,null,null,null,0]
[null,null,null,null,null,null,"-","-",null,null,null,"-","-",null,null,null,null,null,null,null,null,null,null,null,null,null,null,null,0]
[null,null,null,null,null,null,"-","-",null,null,null,"-","-",null,null,null,null,null,null,null,null,null,null,null,null,null,null,null,0]
[null,null,null,null,null,null,"-","-",null,null,null,"-","-",null,null,null,null,null,null,null,null,null,null,null,null,null,null,null,0]
[null,null,null,null,null,null,"-","-",null,null,null,"-","-",null,null,null,null,null,null,null,null,null,null,null,null,null,null,null,0]
[null,null,null,null,null,null,null,null,null,null,null,null,null,null,null,null,null,null,null,null,null,null,null,null,null,null,null,null,{"$f":"SUM(AC59:AC65)","v":1}]
[null,"Superficie Totale disperdente oggetto di intervento                              [mq]",null,null,null,null,null,null,null,{"$f":"SUM(K59:K65)","v":9}]
[null,"Spesa Massima Ammissibile ",null,null,null,null,null,null,null,{"$f":"IF(AC66>0,'Computo-Massimali'!U21,'Computo-Massimali'!U20)","v":54545.454545454544}]
[null,"Costo Complessivo Previsto in progetto",null,null,null,null,null,null,null,{"$f":"IF(AC66>0,'Computo-Massimali'!L21,'Computo-Massimali'!L20)","v":16309.379328058363}]
[null,"Spesa Ammessa",null,null,null,null,null,null,null,{"$f":"IF(J69<J68,J69,J68)","v":16309.379328058363}]
[null,"Costo Lavori Realizzati",null,null,null,null,null,null,null,{"$f":"IF(AC66>0,'SAL.60%'!L21,'SAL.60%'!L20)","v":0}]
[null,"di cui ammessi",null,null,null,null,null,null,null,{"$f":"IF(J71<J70,J71,J70)","v":0}]
[null,"Risparmio di energia primaria non rinnovabile di progetto    [kWh/anno]"]
[]
[]
[null,"Schermature solari e chiusure oscuranti"]
[null,"Descrizione",null,null,null,null,"Tipo Schermatura","Installazione",null,"Superf. Schermatura","Superfice finestra protetta","Resistenza term. suppl m2K/W","Orientamento","Tipo Calcolo",null,"gtot","Materiale schermatura",null,"Meccan. Regolaz."]
[null,"Persiane",null,null,null,null,"-","-",null,3.5,5,0.08,"-","-",null,null,"-",null,"-"]
[null,"Sportelli Legno",null,null,null,null,"-","-",null,3.5,4,null,"-","-",null,null,"-",null,"-"]
[null,null,null,null,null,null,"-","-",null,null,null,null,"-","-",null,null,"-",null,"-"]
[null,null,null,null,null,null,"-","-",null,null,null,null,"-","-",null,null,"-",null,"-"]
[null,null,null,null,null,null,"-","-",null,null,null,null,"-","-",null,null,"-",null,"-"]
[null,null,null,null,null,null,"-","-",null,null,null,null,"-","-",null,null,"-",null,"-"]
[null,null,null,null,null,null,"-","-",null,null,null,null,"-","-",null,null,"-",null,"-"]
[]
[null,"Spesa Massima Ammissibile ",null,null,null,null,null,null,null,{"$f":"'Computo-Massimali'!U22","v":54545.454545454544}]
[null,"Costo Complessivo Previsto in progetto",null,null,null,null,null,null,null,{"$f":"'Computo-Massimali'!L22","v":0}]
[null,"Spesa Ammessa",null,null,null,null,null,null,null,{"$f":"IF(J87<J86,J87,J86)","v":0}]
[null,"Costo Lavori Realizzati",null,null,null,null,null,null,null,{"$f":"'SAL.60%'!L22","v":0}]
[null,"di cui ammessi",null,null,null,null,null,null,null,{"$f":"IF(J89<J88,J89,J88)","v":0}]
[null,"Risparmio di energia primaria non rinnovabile di progetto    [kWh/anno]"]

{"sheet":"SAL.Finale","index":6,"n_rows":44,"n_cols":21,"rows_kept":44,"cut":false,"hidden":false,"merged":[[5,2,5,3],[5,4,5,5],[2,2,2,3],[2,5,2,8],[3,2,3,3],[3,5,3,8],[4,2,4,4],[6,2,6,3],[6,4,6,5],[6,9,6,12],[7,2,7,3],[7,4,7,5],[7,9,7,12],[8,2,8,3],[8,4,8,5],[8,9,8,12],[9,2,9,3],[9,4,9,5],[9,9,9,12],[16,2,16,3],[16,4,16,5],[17,2,17,3],[17,4,17,5],[14,2,14,3],[14,4,14,5],[15,2,15,3],[15,4,15,5],[21,2,21,3],[21,4,21,5],[18,2,18,3],[18,4,18,5],[19,2,19,3],[19,4,19,5],[12,2,12,3],[12,4,12,5],[27,2,27,3],[27,4,27,5],[28,2,28,3],[28,4,28,5],[25,2,25,3],[25,4,25,5],[26,2,26,3],[26,4,26,5],[22,2,22,3],[22,4,22,5],[23,4,23,5],[24,4,24,5],[20,2,20,3],[20,4,20,5],[30,4,30,5],[32,4,32,5],[33,4,33,5],[29,2,29,3],[29,4,29,5],[34,4,34,5],[37,2,37,3],[37,4,37,5],[40,2,40,3],[40,4,40,5],[40,15,40,18],[42,10,42,13],[38,2,38,3],[39,2,39,3],[39,4,39,5],[38,4,38,5]]}
[]
[]
[null,null,"STATO AVANZAMENTO LAVORI Finale",null,null,{"$f":"'Dati Gen'!B27","v":"Rossi Mario"},null,null,null,null,null,null,null,{"$f":"'Dati Gen'!I2","v":"©2021 SIM srl - www.madosoft.it"}]
[null,null,"Data 27/03/2021",null,null,{"$f":"'Dati Gen'!B28","v":"Via Vitaliano, 23"},null,null,null,null,null,null,null,{"$f":"'Dati Gen'!I1","v":"Pratica.110"}]
[]
[null,null,null,null,"Imponibile",null,"%iva","IVA","Importo"]
[null,null,"Importo complessivo Lavori",null,{"$f":"'Computo-Massimali'!F7","v":134860.28},null,{"$f":"'Computo-Massimali'!G7","v":0.1},{"$f":"'Computo-Massimali'!H7","v":13486.028},{"$f":"'Computo-Massimali'!I7","v":148346.30799999999}]
[null,null,"di cui Oneri/Lavori x Sicurezza",null,{"$f":"'Computo-Massimali'!F8","v":8032.08},null,{"$f":"'Computo-Massimali'!G8","v":0.1},{"$f":"'Computo-Massimali'!H8","v":803.20800000000008},{"$f":"'Computo-Massimali'!I8","v":8835.2880000000005}]
[null,null,"Importo b.a.",null,{"$f":"'Computo-Massimali'!F9","v":126828.2},null,{"$f":"'Computo-Massimali'!G9","v":0.1},{"$f":"'Computo-Massimali'!H9","v":12682.82},{"$f":"'Computo-Massimali'!I9","v":139511.01999999999}]
[null,null,"Spese tecniche (compresa iva)",null,{"$f":"'Computo-Massimali'!F10","v":30243.153632640002},null,{"$f":"'Computo-Massimali'!G10","v":0},{"$f":"'Computo-Massimali'!H10","v":0},{"$f":"'Computo-Massimali'!I10","v":30243.153632640002}]
[null,null,null,null,null,null,null,null,{"$f":"'Computo-Massimali'!I11","v":178589.46163263998}]
[null,null,"Lavori Eseguiti"]
[null,null,"Oneri/Lavori x Sicurezza",null,8032.08]
[]
[null,null,"Lavorazione",null,"Importo Lavori Eseguiti  ",null,"Incidenza Sicurezza","Imponibile","Iva","Importo c.iva","Spese tecniche","Totale","% SAL","Detrazione ",null,null,{"$f":"'Computo-Massimali'!U15","v":"Massimale spesa"},null,"Ripartizione Spese Tecniche",null,"Fatturare"]
[null,null,{"$f":"'Computo-Massimali'!C16","v":"Isolamento pareti perimetrali"},null,20381.52,null,{"$f":"$E$13*E16/$E$9","v":1290.7697117959569},{"$f":"SUM(E16:G16)","v":21672.289711795958},{"$f":"H16*'Computo-Massimali'!$G$9","v":2167.2289711795961},{"$f":"SUM(H16:I16)","v":23839.518682975555},{"$f":"'Computo-Massimali'!$AC$14*J16/$I$7","v":4860.1292191068305},{"$f":"SUM(J16:K16)","v":28699.647902082386},{"$f":"IF(L16>0,L16/'Computo-Massimali'!L16,\"\")","v":1.0000000002749372},{"$f":"IF(L16<=Q16,L16*1.1,Q16*1.1)","v":31569.612692290626},null,null,{"$f":"'Computo-Massimali'!U16","v":50000},null,{"$f":"IF('Computo-Massimali'!T3<>0,'Computo-Massimali'!T3,\"-\")","v":"Ape Ante"},{"$f":"$K$41*'Computo-Massimali'!AC3/'Computo-Massimali'!$AC$14","v":832.98800000000017},{"$f":"IF(T16>0,T16-'SAL.30%'!T16-'SAL.60%'!U16,\"\")","v":792.83961828226984}]
[null,null,{"$f":"'Computo-Massimali'!C17","v":"Isolamento coperture"},null,14415.66,null,{"$f":"$E$13*E17/$E$9","v":912.94944162891215},{"$f":"SUM(E17:G17)","v":15328.609441628912},{"$f":"H17*'Computo-Massimali'!$G$9","v":1532.8609441628914},{"$f":"SUM(H17:I17)","v":16861.470385791803},{"$f":"'Computo-Massimali'!$AC$14*J17/$I$7","v":3437.5243052878081},{"$f":"SUM(J17:K17)","v":20298.99469107961},{"$f":"IF(L17>0,L17/'Computo-Massimali'!L17,\"\")","v":1.000000000642667},22328.894160187574,null,null,{"$f":"'Computo-Massimali'!U17","v":50000},null,{"$f":"IF('Computo-Massimali'!T4<>0,'Computo-Massimali'!T4,\"-\")","v":"Progettazione e DL"},{"$f":"$K$41*'Computo-Massimali'!AC4/'Computo-Massimali'!$AC$14","v":21554.270400000001},{"$f":"IF(T17>0,T17-'SAL.30%'!T17-'SAL.60%'!U17,\"\")","v":20515.397000063414}]
[null,null,{"$f":"'Computo-Massimali'!C18","v":"Isolamento Pavimenti"},null,null,null,{"$f":"$E$13*E18/$E$9","v":0},0,{"$f":"H18*'Computo-Massimali'!$G$9","v":0},0,{"$f":"'Computo-Massimali'!$AC$14*J18/$I$7","v":0},0,{"$f":"IF(L18>0,L18/'Computo-Massimali'!L18,\"\")","v":""},0,null,null,{"$f":"'Computo-Massimali'!U18","v":50000},null,{"$f":"IF('Computo-Massimali'!T5<>0,'Computo-Massimali'!T5,\"-\")","v":"Coord.SicurezzaEsec."},{"$f":"$K$41*'Computo-Massimali'!AC5/'Computo-Massimali'!$AC$14","v":5075.2},{"$f":"IF(T18>0,T18-'SAL.30%'!T18-'SAL.60%'!U18,\"\")","v":4830.5853514170367}]
[null,null,{"$f":"'Computo-Massimali'!C19","v":"Isolamento sup. verticali e/o orizzontali"},null,{"$f":"SUM(E16:F18)","v":34797.18},null,{"$f":"SUM(G16:G18)","v":2203.7191534248691},{"$f":"SUM(H16:H18)","v":37000.899153424871},{"$f":"SUM(I16:I18)","v":3700.0899153424875},{"$f":"SUM(J16:J18)","v":40700.989068767361},{"$f":"SUM(K16:K18)","v":8297.6535243946382},{"$f":"IF('Dati Gen'!P17=\"Versione DEMO\",\"Versione DEMO\",SUM(J19:K19))","v":"Versione DEMO"},{"$f":"IF(L19>0,L19/'Computo-Massimali'!L19,\"\")","v":{"$error":"#VALUE!"}},55000.000000000007,null,null,{"$f":"'Computo-Massimali'!U19","v":50000},null,{"$f":"IF('Computo-Massimali'!T6<>0,'Computo-Massimali'!T6,\"-\")","v":"Ape Post"},{"$f":"$K$41*'Computo-Massimali'!AC6/'Computo-Massimali'!$AC$14","v":1069.5880000000002},{"$f":"IF(T19>0,T19-'SAL.30%'!T19-'SAL.60%'!U19,\"\")","v":1018.0359640706665}]
[null,null,{"$f":"'Computo-Massimali'!C20","v":"Serramenti"},null,null,null,{"$f":"$E$13*E20/$E$9","v":0},0,{"$f":"H20*'Computo-Massimali'!$G$9","v":0},0,{"$f":"'Computo-Massimali'!$AC$14*J20/$I$7","v":0},0,{"$f":"IF(L20>0,L20/'Computo-Massimali'!L20,\"\")","v":""},0,null,null,{"$f":"'Computo-Massimali'!U20","v":54545.454545454544},null,{"$f":"IF('Computo-Massimali'!T7<>0,'Computo-Massimali'!T7,\"-\")","v":"-"},{"$f":"$K$41*'Computo-Massimali'!AC7/'Computo-Massimali'!$AC$14","v":0},{"$f":"IF(T20>0,T20-'SAL.30%'!T20-'SAL.60%'!U20,\"\")","v":""}]
[null,null,{"$f":"'Computo-Massimali'!C21","v":"Serramenti + chiusure oscuranti"},null,11582.37,null,733.51606684948615,12315.886066849487,{"$f":"H21*'Computo-Massimali'!$G$9","v":1231.5886066849489},13547.474673534436,{"$f":"'Computo-Massimali'!$AC$14*J21/$I$7","v":2761.9046500705731},16309.37932360501,{"$f":"IF(L21>0,L21/'Computo-Massimali'!L21,\"\")","v":0.9999999997269452},17940.31725596551,null,null,{"$f":"'Computo-Massimali'!U21","v":54545.454545454544},null,{"$f":"IF('Computo-Massimali'!T8<>0,'Computo-Massimali'!T8,\"-\")","v":"-"},{"$f":"$K$41*'Computo-Massimali'!AC8/'Computo-Massimali'!$AC$14","v":0},{"$f":"IF(T21>0,T21-'SAL.30%'!T21-'SAL.60%'!U21,\"\")","v":""}]
[null,null,{"$f":"'Computo-Massimali'!C22","v":"Schermature solari e chiusure Oscuranti"},null,null,null,0,0,{"$f":"H22*'Computo-Massimali'!$G$9","v":0},0,{"$f":"'Computo-Massimali'!$AC$14*J22/$I$7","v":0},0,{"$f":"IF(L22>0,L22/'Computo-Massimali'!L22,\"\")","v":""},0,null,null,{"$f":"'Computo-Massimali'!U22","v":54545.454545454544},null,{"$f":"IF('Computo-Massimali'!T9<>0,'Computo-Massimali'!T9,\"-\")","v":"-"},{"$f":"$K$41*'Computo-Massimali'!AC9/'Computo-Massimali'!$AC$14","v":0},{"$f":"IF(T22>0,T22-'SAL.30%'!T22-'SAL.60%'!U22,\"\")","v":""}]
[null,null,{"$f":"'Computo-Massimali'!C23","v":"Solare Termico    - con collettori solari"},null,4925.08,null,311.90726168470417,5236.9872616847042,{"$f":"H23*'Computo-Massimali'!$G$9","v":523.69872616847044},5760.685987853175,{"$f":"'Computo-Massimali'!$AC$14*J23/$I$7","v":1174.4229681809143},6935.1089560340897,{"$f":"IF(L23>0,L23/'Computo-Massimali'!L23,\"\")","v":0.99999999894384517},7628.6198516374989,null,null,{"$f":"'Computo-Massimali'!U23","v":30000},null,{"$f":"IF('Computo-Massimali'!T10<>0,'Computo-Massimali'!T10,\"-\")","v":"-"},{"$f":"$K$41*'Computo-Massimali'!AC10/'Computo-Massimali'!$AC$14","v":0},{"$f":"IF(T23>0,T23-'SAL.30%'!T23-'SAL.60%'!U23,\"\")","v":""}]
[null,null,{"$f":"'Computo-Massimali'!C24","v":"Solare Fotovoltaico              kWp"},{"$f":"'Computo-Massimali'!D24","v":6},13474.07,null,853.31817502416664,14327.388175024167,{"$f":"H24*'Computo-Massimali'!$G$9","v":1432.7388175024169},15760.126992526584,{"$f":"'Computo-Massimali'!$AC$14*J24/$I$7","v":3212.9949732547316},18973.121965781316,{"$f":"IF(L24>0,L24/'Computo-Massimali'!L24,\"\")","v":0.99999999988757104},15840.000000000002,null,null,{"$f":"'Computo-Massimali'!U24","v":14400},null,{"$f":"IF('Computo-Massimali'!T13<>0,'Computo-Massimali'!T13,\"-\")","v":"Visto Conformità"},{"$f":"$K$41*'Computo-Massimali'!AC13/'Computo-Massimali'!$AC$14","v":1711.1072326399999},{"$f":"IF(T24>0,T24-'SAL.30%'!T24-'SAL.60%'!U24,\"\")","v":1628.6352326399999}]
[null,null,{"$f":"'Computo-Massimali'!C25","v":"Sistema di Accumulo           kWh"},{"$f":"'Computo-Massimali'!D25","v":10},6455.26,null,408.81416546793224,6864.0741654679323,{"$f":"H25*'Computo-Massimali'!$G$9","v":686.40741654679323},7550.4815820147251,{"$f":"'Computo-Massimali'!$AC$14*J25/$I$7","v":1539.306084282799},9089.787666297525,{"$f":"IF(L25>0,L25/'Computo-Massimali'!L25,\"\")","v":0.99999999933081762},9998.7664329272775,null,null,{"$f":"'Computo-Massimali'!U25","v":10000},null,null,{"$f":"SUM(T16:T24)","v":30243.153632640002},{"$f":"SUM(U16:U24)","v":28785.493166473389}]
[null,null,{"$f":"'Computo-Massimali'!C26","v":"Impianti climatizzazione e ACS"},null,21332.86,null,1351.0184497517116,22683.878449751712,{"$f":"H26*'Computo-Massimali'!$G$9","v":2268.3878449751714},24952.266294726884,{"$f":"'Computo-Massimali'!$AC$14*J26/$I$7","v":5086.9835131587506},{"$f":"IF('Dati Gen'!P17=\"Versione DEMO\",\"Versione DEMO\",SUM(J26:K26))","v":"Versione DEMO"},{"$f":"IF(L26>0,L26/'Computo-Massimali'!L26,\"\")","v":{"$error":"#VALUE!"}},33000,null,null,{"$f":"'Computo-Massimali'!U26","v":30000}]
[null,null,{"$f":"'Computo-Massimali'!C27","v":"Impianti Biomassa"},null,0,null,0,0,{"$f":"H27*'Computo-Massimali'!$G$9","v":0},0,{"$f":"'Computo-Massimali'!$AC$14*J27/$I$7","v":0},0,{"$f":"IF(L27>0,L27/'Computo-Massimali'!L27,\"\")","v":""},0,null,null,{"$f":"'Computo-Massimali'!U27","v":30000}]
[null,null,{"$f":"'Computo-Massimali'!C28","v":"Sistemi di Building Automation"},null,5541.15,null,350.92321811710644,5892.0732181171061,{"$f":"H28*'Computo-Massimali'!$G$9","v":589.20732181171059},6481.2805399288163,{"$f":"'Computo-Massimali'!$AC$14*J28/$I$7","v":1321.3295682782152},7802.6101082070318,{"$f":"IF(L28>0,L28/'Computo-Massimali'!L28,\"\")","v":1.0000000007035121},8582.8711190277354,null,null,{"$f":"'Computo-Massimali'!U28","v":15000}]
[null,null,{"$f":"'Computo-Massimali'!C29","v":"Colonnine di Ricarica"},null,null,null,0,0,{"$f":"H29*'Computo-Massimali'!$G$9","v":0},0,{"$f":"'Computo-Massimali'!$AC$14*J29/$I$7","v":0},0,{"$f":"IF(L29>0,L29/'Computo-Massimali'!L29,\"\")","v":""},0,null,null,{"$f":"'Computo-Massimali'!U29","v":2000}]
[null,null,{"$f":"'Computo-Massimali'!C30","v":"SismaBonus"},null,null,null,0,0,{"$f":"H30*'Computo-Massimali'!$G$9","v":0},0,{"$f":"'Computo-Massimali'!$AC$14*J30/$I$7","v":0},0,{"$f":"IF(L30>0,L30/'Computo-Massimali'!L30,\"\")","v":""},0,null,null,{"$f":"'Computo-Massimali'!U30","v":96000}]
[null,null,null,null,{"$f":"SUM(E19:F30)","v":98107.97},null,{"$f":"SUM(G19:G30)","v":6213.2164903199755},104321.18649031997,10432.118649032,114753.30513935199,23394.595281620623,59110.008019924971,null,{"$f":"SUM(N19:N30)","v":147990.57465955801}]
[]
[null,null,{"$f":"'Computo-Massimali'!C33","v":"Lavori Ristrutturazione"},{"$f":"'Computo-Massimali'!E33","v":0.5},28720.23,null,{"$f":"$E$13*E33/$E$9","v":1818.8635096800238},{"$f":"SUM(E33:G33)","v":30539.093509680024},{"$f":"H33*'Computo-Massimali'!$G$9","v":3053.9093509680024},{"$f":"SUM(H33:I33)","v":33593.002860648026},{"$f":"'Computo-Massimali'!$AC$14*J33/$I$7","v":6848.5583510193819},{"$f":"SUM(J33:K33)","v":40441.561211667409},{"$f":"IF(L33>0,L33/'Computo-Massimali'!L33,\"\")","v":1.000000000236436},{"$f":"IF(L33<=Q33*D33,L33*D33,U33*D33)","v":20220.780605833705},null,null,{"$f":"'Computo-Massimali'!U33","v":96000}]
[null,null,{"$f":"'Computo-Massimali'!C34","v":"-"},{"$f":"'Computo-Massimali'!E34","v":0},null,null,0,0,{"$f":"H34*'Computo-Massimali'!$G$9","v":0},0,{"$f":"'Computo-Massimali'!$AC$14*J34/$I$7","v":0},0,{"$f":"IF(L34>0,L34/'Computo-Massimali'!L34,\"\")","v":""},{"$f":"IF(L34<=Q34*D34,L34*D34,U34*D34)","v":0},null,null,{"$f":"'Computo-Massimali'!U34","v":96000}]
[null,null,null,null,{"$f":"SUM(E33:F34)","v":28720.23},null,{"$f":"SUM(G33:G34)","v":1818.8635096800238},{"$f":"SUM(H33:H34)","v":30539.093509680024},{"$f":"SUM(I33:I34)","v":3053.9093509680024},{"$f":"SUM(J33:J34)","v":33593.002860648026},6848.5583510193819,40441.561211667409,null,{"$f":"SUM(N33:N34)","v":20220.780605833705}]
[]
[]
[null,null,null,null,{"$f":"E15","v":"Importo Lavori Eseguiti  "},null,"Incidenza Sicurezza","Imponibile",{"$f":"I15","v":"Iva"},"Importo c.iva","Spese tecniche","Totale","% SAL","Detrazione "]
[null,null,{"$f":"'SAL.30%'!C39","v":"Totali SAL N.1"},null,{"$f":"'SAL.30%'!E39","v":6500},null,{"$f":"'SAL.30%'!G39","v":0},{"$f":"'SAL.30%'!H39","v":6500},{"$f":"'SAL.30%'!I39","v":650},{"$f":"'SAL.30%'!J39","v":7150},{"$f":"'SAL.30%'!K39","v":1457.6604661666136},{"$f":"'SAL.30%'!L39","v":8607.6604661666133},{"$f":"'SAL.30%'!M39","v":5.1250431686328438E-2},{"$f":"'SAL.30%'!N39","v":88000}]
[null,null,{"$f":"'SAL.60%'!C39","v":"Totali SAL N.2"},null,{"$f":"'SAL.60%'!E39","v":0},null,{"$f":"'SAL.60%'!G39","v":0},{"$f":"'SAL.60%'!H39","v":0},{"$f":"'SAL.60%'!I39","v":0},{"$f":"'SAL.60%'!J39","v":0},{"$f":"'SAL.60%'!K39","v":0},{"$f":"'SAL.60%'!L39","v":0},{"$f":"'SAL.60%'!M39","v":0},{"$f":"'SAL.60%'!N39","v":88000}]
[null,null,"Totali SAL Finale",null,{"$f":"E31+E35","v":126828.2},null,{"$f":"G31+G35","v":8032.079999999999},{"$f":"H31+H35","v":134860.28},{"$f":"I35+I31","v":13486.028000000002},{"$f":"J35+J31","v":148346.30800000002},{"$f":"K35+K31","v":30243.153632640006},{"$f":"L35+L31","v":99551.569231592381},{"$f":"E41/E9","v":1},{"$f":"N35+N31","v":168211.35526539173},null,{"$f":"IF(M41>=100%,\"V.\",\"\")","v":"V."}]
[]
[null,null,null,null,null,null,null,null,null,null,{"$f":"IF(M41>=100%,\"\",\"SAL inferiore 100%\")","v":""}]
[null,null,null,null,null,null,null,null,null,null,null,null,{"$f":"'Computo-Massimali'!G43","v":"Quota a carico cliente :"},{"$f":"'Computo-Massimali'!H43","v":27360.749935337022}]

{"sheet":"Enea SAL Finale","index":7,"n_rows":91,"n_cols":30,"rows_kept":91,"cut":false,"hidden":false,"merged":[[1,2,1,11],[1,12,1,19],[2,2,2,5],[4,2,4,11],[5,6,5,11],[6,6,6,11],[14,1,14,6],[14,7,14,8],[14,9,14,10],[18,1,18,5],[19,1,19,5],[20,1,20,5],[7,6,7,11],[9,2,9,6],[10,2,10,5],[10,6,10,10],[11,6,11,11],[12,2,12,6],[27,1,27,5],[29,1,29,8],[29,9,29,10],[30,1,30,8],[30,9,30,10],[31,1,31,8],[31,9,31,10],[21,1,21,5],[22,1,22,5],[23,1,23,5],[24,1,24,5],[25,1,25,5],[26,1,26,5],[35,1,35,8],[35,9,35,10],[40,1,40,5],[41,1,41,5],[42,1,42,5],[43,1,43,5],[32,1,32,8],[32,9,32,10],[33,1,33,8],[33,9,33,10],[34,1,34,8],[34,9,34,10],[49,16,49,18],[50,1,50,5],[50,9,50,15],[50,16,50,18],[51,1,51,5],[51,9,51,15],[51,16,51,18],[44,1,44,5],[45,1,45,5],[46,1,46,5],[47,1,47,5],[49,1,49,5],[49,9,49,15],[57,1,57,5],[57,7,57,8],[57,12,57,13],[58,1,58,5],[58,7,58,8],[58,12,58,13],[52,9,52,15],[52,16,52,18],[53,9,53,15],[53,16,53,18],[54,9,54,16],[54,17,54,18],[61,1,61,5],[61,7,61,8],[61,12,61,13],[62,1,62,5],[62,7,62,8],[62,12,62,13],[59,1,59,5],[59,7,59,8],[59,12,59,13],[60,1,60,5],[60,7,60,8],[60,12,60,13],[66,1,66,8],[66,9,66,10],[67,1,67,8],[67,9,67,10],[68,1,68,8],[68,9,68,10],[63,1,63,5],[63,7,63,8],[63,12,63,13],[64,1,64,5],[64,7,64,8],[64,12,64,13],[72,1,72,8],[72,9,72,10],[76,1,76,5],[76,7,76,8],[76,13,76,14],[76,16,76,17],[69,1,69,8],[69,9,69,10],[70,1,70,8],[70,9,70,10],[71,1,71,8],[71,9,71,10],[79,1,79,5],[79,7,79,8],[79,13,79,14],[79,16,79,17],[80,1,80,5],[80,7,80,8],[80,13,80,14],[80,16,80,17],[77,1,77,5],[77,7,77,8],[77,13,77,14],[77,16,77,17],[78,1,78,5],[78,7,78,8],[78,13,78,14],[78,16,78,17],[83,1,83,5],[83,7,83,8],[83,13,83,14],[83,16,83,17],[85,1,85,8],[85,9,85,10],[81,1,81,5],[81,7,81,8],[81,13,81,14],[81,16,81,17],[82,1,82,5],[82,7,82,8],[82,13,82,14],[82,16,82,17],[89,1,89,8],[89,9,89,10],[90,1,90,8],[90,9,90,10],[86,1,86,8],[86,9,86,10],[87,1,87,8],[87,9,87,10],[88,1,88,8],[88,9,88,10]]}
[]
[null,"Tipologia Edificio",{"$f":"'Dati Gen'!B4","v":"Edificio Unifamiliare"},null,null,null,null,null,null,null,null,null,"https://detrazionifiscali.enea.it/creaasseverazione.asp"]
[null,"Data Inizio Lavori",{"$f":"'Dati Gen'!C30","v":"2021-03-15"}]
[]
[null,"Comune Ubicazione",{"$f":"'Dati Gen'!C7","v":"ROMA"}]
[null,"Comune Montano","X","SI",null,"NO","Elenco Comuni Montani"]
[null,"Interessato Infrazione",null,"SI","X","NO","Elenco Comuni Infrazioni"]
[null,"Intervento comma 4-Ter",null,"SI","X","NO","160% Zone Terremotate"]
[]
[null,"Indirizzo",{"$f":"'Dati Gen'!C8","v":"Via Vitaliano"},null,null,null,null,null,"N.Civico ",{"$f":"'Dati Gen'!K8","v":23},"CAP",{"$f":"'Dati Gen'!K7","v":0}]
[null,"Anno di Costruzione Immobile",{"$f":"'Dati Gen'!C10","v":0},null,null,null,{"$f":"'Dati Gen'!F10","v":"Superficie Totale Disperdente   :"},null,null,null,null,{"$f":"'Dati Gen'!K10","v":0}]
[null,"Edificio in area Metanizzata","X","SI",null,"NO"]
[null,"Autorizzazione Edilizia",{"$f":"'Dati Gen'!C11","v":"Edificio Storico senza Titolo Edilizio"},null,null,null,null,null,{"$f":"'Dati Gen'!H11","v":""},{"$f":"IF('Dati Gen'!I11<>\"\",'Dati Gen'!I11,\"\")","v":""},{"$f":"'Dati Gen'!J11","v":""},{"$f":"IF('Dati Gen'!I13<>\"\",'Dati Gen'!I13,\"\")","v":""}]
[]
[null,{"$f":"'Dati Gen'!B32","v":"Relazione ex Legge 10/91  Depositata al Comune in Data "},null,null,null,null,null,{"$f":"IF('Dati Gen'!G32<>\"\",'Dati Gen'!G32,\"\")","v":44270},null,"Prot. N.",null,{"$f":"IF('Dati Gen'!K32<>\"\",'Dati Gen'!K32,\"\")","v":25658}]
[]
[]
[null,"intervento di isolamento termico delle superfici opache verticali, orizzontali e inclinate "]
[null,"Descrizione",null,null,null,null,"Superficie mq","Trasm. Ante","Trasm. Post","Trasm.P. YIE","Confine","Coiben-tazione","Realizzati mq"]
[null,"Pareti Verticali Mattoni Pieni 30cm",null,null,null,null,50,3,1.26,0.03,"Esterno","Esterna",30]
[null,"Pareti Verticali Pietrame 50cm",null,null,null,null,20,null,null,null,"-","-"]
[null,"Coperture Legno",null,null,null,null,null,null,null,null,"-","-"]
[null,"Coperture Acciaio",null,null,null,null,null,null,null,null,"-","-"]
[null,"Pavimenti",null,null,null,null,null,null,null,null,"-","-"]
[null,null,null,null,null,null,null,null,null,null,"-","-"]
[null,null,null,null,null,null,null,null,null,null,"-","-"]
[null,null,null,null,null,null,null,null,null,null,"-","-"]
[null,null,null,null,null,null,null,null,null,null,"-","-"]
[]
[null,"Superficie Totale disperdente oggetto di intervento                              [mq]",null,null,null,null,null,null,null,{"$f":"SUM(G20:G28)","v":70}]
[null,"Spesa Massima Ammissibile ",null,null,null,null,null,null,null,{"$f":"'SAL.60%'!Q19","v":50000}]
[null,"Costo Complessivo Previsto in progetto",null,null,null,null,null,null,null,{"$f":"'Computo-Massimali'!L19","v":48998.642572225901}]
[null,"Spesa Ammessa",null,null,null,null,null,null,null,{"$f":"IF(J32<J31,J32,J31)","v":48998.642572225901}]
[null,"Costo Lavori Realizzati",null,null,null,null,null,null,null,{"$f":"'SAL.60%'!L19","v":"Versione DEMO"}]
[null,"di cui ammessi",null,null,null,null,null,null,null,{"$f":"IF(J34<J33,J34,J33)","v":48998.642572225901}]
[null,"Risparmio di energia primaria non rinnovabile di progetto    [kWh/anno]"]
[]
[]
[]
[null,"Intervento di sostituzione degli impianti di climatizzazione invernale esistenti"]
[null,"Descrizione",null,null,null,null,"Tipo Sostituito","P.Nom Sostituito","P.Nom Nuova","Rendim Nomin.","Destinata","Efficienza  Riscaldam. hs","Efficienza  ACS hw","Tipo Aliment.","Classe Dispositivo Termoreg. Evoluto","Tipo PDC","Pot. Elettr. Assorb","COP","Superfic. Risc. Da PDC",null,null,null,null,null,null,null,null,null,null,"Tipo Sostituito"]
[null,"Caldaia a Condensazione",null,null,null,null,"-",24,26,0.03,"-",0,null,"-","-","Salamoia/Acqua",null,null,null,null,null,null,null,null,null,null,null,null,null,"-"]
[null,"Pompe calore PDC compr. vapore el. sonde geot.",null,null,null,null,"-",null,null,null,"-",null,null,"-","-","-",null,null,null,null,null,null,null,null,null,null,null,null,null,"Caldaia Standard"]
[null,"Coperture Legno",null,null,null,null,"-",null,null,null,"-",null,null,"-","-","-",null,null,null,null,null,null,null,null,null,null,null,null,null,"Caldaia Bassa Temp."]
[null,"Coperture Acciaio",null,null,null,null,"-",null,null,null,"-",null,null,"-","-","-",null,null,null,null,null,null,null,null,null,null,null,null,null,"Caldaia Condens. Gas"]
[null,"Pavimenti",null,null,null,null,"-",null,null,null,"-",null,null,"-","-","-",null,null,null,null,null,null,null,null,null,null,null,null,null,"Caldaia Condens.Gasolio"]
[null,null,null,null,null,null,"-",null,null,null,"-",null,null,"-","-","-",null,null,null,null,null,null,null,null,null,null,null,null,null,"Teleriscaldamento"]
[null,null,null,null,null,null,"-",null,null,null,"-",null,null,"-","-","-",null,null,null,null,null,null,null,null,null,null,null,null,null,"Impianto biomassa"]
[null,null,null,null,null,null,null,null,null,null,null,null,null,null,null,null,null,null,null,null,null,null,null,null,null,null,null,null,null,"Altro"]
[null,"Destinati a :   Climatizzazione Invernale",null,null,null,null,"X",null,null,"Spesa Massima Ammissibile ",null,null,null,null,null,null,{"$f":"'Computo-Massimali'!U26","v":30000}]
[null,"                         Climatizzazione estiva",null,null,null,null,null,null,null,"Costo Complessivo Previsto in progetto",null,null,null,null,null,null,{"$f":"'Computo-Massimali'!L26","v":30039.249791238235}]
[null,"                         prod. di acqua calda sanitaria",null,null,null,null,null,null,null,"Spesa Ammessa",null,null,null,null,null,null,{"$f":"IF(Q51<Q50,Q51,Q50)","v":30000}]
[null,null,null,null,null,null,null,null,null,"Costo Lavori Realizzati",null,null,null,null,null,null,{"$f":"'SAL.60%'!L26","v":"Versione DEMO"}]
[null,null,null,null,null,null,null,null,null,"di cui ammessi",null,null,null,null,null,null,{"$f":"IF(Q53<Q52,Q53,Q52)","v":30000}]
[null,null,null,null,null,null,null,null,null,"Risparmio di energia primaria non rinnovabile di progetto    [kWh/anno]"]
[]
[null,"Sostituzione degli infissi "]
[null,"Descrizione",null,null,null,null,"Telaio Prima","Vetro Prima",null,"Trasm. Ante","Superfice mq","Telaio Dopo","Vetro Dopo",null,"Trasm. Post","Chius. Oscura"]
[null,"Infissi in Legno 1 Anta Vetro Singolo con 1A2V",null,null,null,null,"Legno","Singolo",null,3.5,5,"Legno","Singolo",null,1.3,"x",null,null,null,null,null,null,null,null,null,null,null,null,{"$f":"IF(P59<>\"\",1,0)","v":1}]
[null,"Portoni Ingresso",null,null,null,null,"Legno","Nessuno",null,3.5,4,"Legno","Nessuno",null,1.3,null,null,null,null,null,null,null,null,null,null,null,null,null,{"$f":"IF(P60<>\"\",1,0)","v":0}]
[null,null,null,null,null,null,"-","-",null,null,null,"-","-",null,null,null,null,null,null,null,null,null,null,null,null,null,null,null,0]
[null,null,null,null,null,null,"-","-",null,null,null,"-","-",null,null,null,null,null,null,null,null,null,null,null,null,null,null,null,0]
[null,null,null,null,null,null,"-","-",null,null,null,"-","-",null,null,null,null,null,null,null,null,null,null,null,null,null,null,null,0]
[null,null,null,null,null,null,"-","-",null,null,null,"-","-",null,null,null,null,null,null,null,null,null,null,null,null,null,null,null,0]
[null,null,null,null,null,null,"-","-",null,null,null,"-","-",null,null,null,null,null,null,null,null,null,null,null,null,null,null,null,0]
[null,null,null,null,null,null,null,null,null,null,null,null,null,null,null,null,null,null,null,null,null,null,null,null,null,null,null,null,{"$f":"SUM(AC59:AC65)","v":1}]
[null,"Superficie Totale disperdente oggetto di intervento                              [mq]",null,null,null,null,null,null,null,{"$f":"SUM(K59:K65)","v":9}]
[null,"Spesa Massima Ammissibile ",null,null,null,null,null,null,null,{"$f":"IF(AC66>0,'Computo-Massimali'!U21,'Computo-Massimali'!U20)","v":54545.454545454544}]
[null,"Costo Complessivo Previsto in progetto",null,null,null,null,null,null,null,{"$f":"IF(AC66>0,'Computo-Massimali'!L21,'Computo-Massimali'!L20)","v":16309.379328058363}]
[null,"Spesa Ammessa",null,null,null,null,null,null,null,{"$f":"IF(J69<J68,J69,J68)","v":16309.379328058363}]
[null,"Costo Lavori Realizzati",null,null,null,null,null,null,null,{"$f":"IF(AC66>0,'SAL.60%'!L21,'SAL.60%'!L20)","v":0}]
[null,"di cui ammessi",null,null,null,null,null,null,null,{"$f":"IF(J71<J70,J71,J70)","v":0}]
[null,"Risparmio di energia primaria non rinnovabile di progetto    [kWh/anno]"]
[]
[]
[null,"Schermature solari e chiusure oscuranti"]
[null,"Descrizione",null,null,null,null,"Tipo Schermatura","Installazione",null,"Superf. Schermatura","Superfice finestra protetta","Resistenza term. suppl m2K/W","Orientamento","Tipo Calcolo",null,"gtot","Materiale schermatura",null,"Meccan. Regolaz."]
[null,"Persiane",null,null,null,null,"-","-",null,3.5,5,0.08,"-","-",null,null,"-",null,"-"]
[null,"Sportelli Legno",null,null,null,null,"-","-",null,3.5,4,null,"-","-",null,null,"-",null,"-"]
[null,null,null,null,null,null,"-","-",null,null,null,null,"-","-",null,null,"-",null,"-"]
[null,null,null,null,null,null,"-","-",null,null,null,null,"-","-",null,null,"-",null,"-"]
[null,null,null,null,null,null,"-","-",null,null,null,null,"-","-",null,null,"-",null,"-"]
[null,null,null,null,null,null,"-","-",null,null,null,null,"-","-",null,null,"-",null,"-"]
[null,null,null,null,null,null,"-","-",null,null,null,null,"-","-",null,null,"-",null,"-"]
[]
[null,"Spesa Massima Ammissibile ",null,null,null,null,null,null,null,{"$f":"'Computo-Massimali'!U22","v":54545.454545454544}]
[null,"Costo Complessivo Previsto in progetto",null,null,null,null,null,null,null,{"$f":"'Computo-Massimali'!L22","v":0}]
[null,"Spesa Ammessa",null,null,null,null,null,null,null,{"$f":"IF(J87<J86,J87,J86)","v":0}]
[null,"Costo Lavori Realizzati",null,null,null,null,null,null,null,{"$f":"'SAL.60%'!L22","v":0}]
[null,"di cui ammessi",null,null,null,null,null,null,null,{"$f":"IF(J89<J88,J89,J88)","v":0}]
[null,"Risparmio di energia primaria non rinnovabile di progetto    [kWh/anno]"]