{"text_format":"1","workbook":"xlsx","n_sheets":7,"sheets":["Dati Gen","Computo-Massimali","SAL.30%","SAL.60%","SAL.Finale","Pratica ENEA","Fatture"],"not_rendered":{"charts":0,"images":1,"macros":1,"external_links":0,"defined_names":4,"comments":6,"pivot_tables":0},"unopened":[],"bounds":{"document_bytes":16777216,"sheet_cells":100000,"rows_first":2000,"rows_last":500,"rows_between":2000,"halvings":0,"cell_chars":16384,"cell_head_chars":4096},"cells_cut":0,"cells_raw":0,"read":"whole","date_system":"1900"}

{"sheet":"Dati Gen","index":0,"n_rows":33,"n_cols":27,"rows_kept":33,"cut":false,"hidden":false,"merged":[[1,14,1,15],[30,2,30,4],[10,2,10,4],[10,5,10,9],[4,1,4,2],[5,1,5,4],[8,2,8,8],[7,2,7,8],[23,2,23,6],[23,7,23,8],[19,2,19,5],[19,7,19,10],[26,2,26,5],[21,2,21,10],[22,2,22,10],[9,2,9,3],[15,2,15,10],[17,2,17,8],[18,2,18,8],[16,9,16,10],[11,2,11,6],[16,7,16,8],[16,2,16,6],[14,2,14,10],[32,8,32,9],[32,6,32,7],[24,2,24,8],[25,2,25,8],[23,9,23,10],[26,7,26,10],[27,1,27,4],[28,1,28,4]]}
[null,"https://www.madosoft.it/prodotti/superbonus110/pratica-110-xlsm",null,null,null,null,null,null,null,null,null,null,null,null,null,null,null,null,null,null,null,null,null,null,null,null,0]
[0,null,null,null,null,null,null,null,"Pratica.110","Versione","1.9",null,null,null,"Titolare Licenza d'uso"]
[null,"PRATICA SUPERBONUS 110%",null,"N.",1,null,null,null,"©2021 SIM srl - www.madosoft.it",null,null,null,null,null,"Cognome "]
["","Tipologia",null,null,null,null,null,null,null,null,null,null,null,null,"Nome"]
[null,"Condominio",null,null,3,null,null,null,null,null,null,null,null,null,"Codice Fiscale"]
[null,{"$f":"IF('Dati Gen'!B5=\"Edificio Unifamiliare\", IF('Dati Gen'!E5>1,\"Inserire N.Unità Immobiliari =1\",\"\"),IF('Dati Gen'!E5<=1,\"Inserire N.Unità Immobiliari >1\",\"\"))","v":""},null,null,null,null,null,null,null,null,null,null,null,null,"P.Iva"]
[null,"Dati Edificio",null,null,null,null,null,null,null,null,null,null,null,null,"Indirizzo"]
[null,"Comune di Ubicazione",null,null,null,null,null,null,null,"CAP",null,null,null,null,"CAP"]
[null,"Indirizzo",null,null,null,null,null,null,null,"N.",null,null,null,null,"Città"]
[null,"Dati Catastali","Foglio",null,null,"Particella",null,"Sub.",null,"CAT.",null,null,null,null,"Provincia"]
[null,"Anno di Costruzione Immobile",null,null,null,"Superficie Totale Disperdente   :",null,null,null,null,null,null,null,null,"Telefono"]
[null,"Autorizzazione Edilizia","Licenza Edilizia / Titolo Edilizio",null,null,null,null,{"$f":"IF(C12=\"Licenza Edilizia / Titolo Edilizio\",\"N.\",IF(C12=\"Concessione in Sanatoria\",\"N.\",\"\"))","v":"N."},null,{"$f":"IF(C12=\"Licenza Edilizia / Titolo Edilizio\",\"Data\",IF(C12=\"Concessione in Sanatoria\",\"Data\",\"\"))","v":"Data"},null,null,null,null,"Mail"]
[null,null,null,null,null,null,null,null,null,null,null,null,null,null,"Codice Univoco"]
[null,"Dati Committenti",null,null,null,null,null,null,null,null,null,null,null,null,"Mail PEC"]
[null,"Cognome Nome"]
[null,"Codice Fiscale",null,null,null,null,null,null,null,null,null,null,null,null,"Controlla Aggiornamenti"]
[null,"Comune di Nascita",null,null,null,null,null,"Data Nascita",null,null,null,null,null,null,"Licenza N.","Versione DEMO",{"$f":"IF(MID(P17,1,2)<>\"AP\",\"Acquista Licenza x 100 Attivazioni\",\"\")","v":"Acquista Licenza x 100 Attivazioni"}]
[null,"Comune di Residenza",null,null,null,null,null,null,null,"CAP"]
[null,"Indirizzo",null,null,null,null,null,null,null,"N."]
[null,"Telefono",null,null,null,null,"Email"]
[]
[null,"Cognome Nome"]
[null,"Codice Fiscale"]
[null,"Comune di Nascita",null,null,null,null,null,"Data Nascita"]
[null,"Comune di Residenza",null,null,null,null,null,null,null,"CAP"]
[null,"Indirizzo",null,null,null,null,null,null,null,"N."]
[null,"Telefono",null,null,null,null,"Email"]
[null,{"$f":"IF(C22<>\"\",CONCATENATE(C15, \" - \",C22),C15)","v":0}]
[null,{"$f":"IF(K9<>\"\",CONCATENATE(C9,\", \",K9),C9)","v":0}]
[]
[null,"Data Inizio Lavori",null,null,null,"  Superficie lorda complessiva disperdente"]
[]
[null,"Relazione ex Legge 10/91  Depositata al Comune in Data ",null,null,null,null,null,null,"Prot. N."]

{"sheet":"Computo-Massimali","index":1,"n_rows":46,"n_cols":32,"rows_kept":46,"cut":false,"hidden":false,"merged":[[41,21,41,22],[35,21,36,22],[39,21,39,22],[10,9,10,15],[14,21,17,22],[19,21,20,22],[33,21,33,22],[37,21,37,22],[33,23,33,24],[15,23,17,24],[14,23,14,26],[15,19,15,20],[16,19,16,20],[17,19,17,20],[18,19,18,20],[19,19,19,20],[20,19,20,20],[21,19,21,20],[22,19,22,20],[23,19,23,20],[11,23,11,24],[37,23,37,24],[37,25,37,26],[39,25,39,26],[32,21,32,22],[22,25,22,26],[23,25,23,26],[39,23,39,24],[23,23,23,24],[24,23,24,24],[33,25,33,26],[18,21,18,22],[21,21,21,22],[22,21,22,22],[23,21,23,22],[24,21,24,22],[25,21,25,22],[26,21,26,22],[27,21,27,22],[28,21,28,22],[35,19,35,20],[36,19,36,20],[14,19,14,20],[24,25,24,26],[25,25,25,26],[26,25,26,26],[27,25,27,26],[28,25,28,26],[29,25,29,26],[30,25,30,26],[31,25,31,26],[32,25,32,26],[35,25,35,26],[36,25,36,26],[24,19,24,20],[25,19,25,20],[26,19,26,20],[27,19,27,20],[28,19,28,20],[29,19,29,20],[30,19,30,20],[31,19,31,20],[32,19,32,20],[29,21,29,22],[1,25,1,27],[10,20,10,21],[10,22,10,24],[10,25,10,27],[2,26,2,27],[3,26,3,27],[1,18,1,19],[2,18,2,19],[3,18,3,19],[4,18,4,19],[5,18,5,19],[6,18,6,19],[7,18,7,19],[8,18,8,19],[8,23,8,24],[1,22,1,24],[1,20,1,21],[3,23,3,24],[9,23,9,24],[9,26,9,27],[6,23,6,24],[6,26,6,27],[7,23,7,24],[7,26,7,27],[19,23,19,24],[31,23,31,24],[18,25,18,26],[19,25,19,26],[30,2,30,3],[30,23,30,24],[11,26,11,27],[20,25,20,26],[21,25,21,26],[15,25,17,26],[21,23,21,24],[30,21,30,22],[31,21,31,22],[32,2,32,3],[32,23,32,24],[33,2,33,3],[2,23,2,24],[6,20,6,21],[7,20,7,21],[8,20,8,21],[2,20,2,21],[3,20,3,21],[4,20,4,21],[4,23,4,24],[16,2,16,3],[17,2,17,3],[9,2,9,3],[9,9,9,15],[23,2,23,3],[20,2,20,3],[20,23,20,24],[22,2,22,3],[22,23,22,24],[14,2,14,3],[15,2,15,3],[19,2,19,3],[5,2,5,3],[4,26,4,27],[11,18,11,19],[21,2,21,3],[24,2,24,3],[2,5,2,8],[3,5,3,8],[18,2,18,3],[18,23,18,24],[37,2,37,3],[28,2,28,3],[28,23,28,24],[29,2,29,3],[29,23,29,24],[25,23,25,24],[26,2,26,3],[26,23,26,24],[25,2,25,3],[27,2,27,3],[27,23,27,24],[31,2,31,3],[35,2,35,3],[35,23,35,24],[36,2,36,3],[36,23,36,24],[13,30,13,31],[5,20,5,21],[5,23,5,24],[5,26,5,27],[6,2,6,3],[6,9,6,15],[7,2,7,3],[7,9,7,15],[8,2,8,3],[8,9,8,15],[8,26,8,27],[12,23,12,24],[12,26,12,27],[12,20,12,21]]}
[]
[null,null,null,null,null,null,null,null,null,null,null,null,null,null,null,null,null,null,"PARCELLA",null,"imponibile",null,"c.cassa",null,null,"iva",null,null,"totale"]
[null,null,"Verifica Massimali Superbonus",null,null,{"$f":"'Dati Gen'!B28","v":0},null,null,null,null,null,null,null,null,{"$f":"'Dati Gen'!I3","v":"©2021 SIM srl - www.madosoft.it"},null,null,null,"Ape Ante",null,800.95,null,0.04,{"$f":"U3*W3","v":32.038000000000004},null,0.22,{"$f":"(U3+X3)*Z3","v":183.25736000000001},null,{"$f":"ROUND(U3+X3+AA3,2)","v":1016.25}]
[null,null,{"$f":"'Dati Gen'!B5","v":"Condominio"},{"$f":"IF('Dati Gen'!E5>1,'Dati Gen'!E5,\"\")","v":3},null,{"$f":"'Dati Gen'!B29","v":0},null,null,null,null,null,null,null,null,{"$f":"'Dati Gen'!I2","v":"Pratica.110"},null,null,null,"Progettazione e DL",null,20725.259999999998,null,0.04,829.0104,null,0.22,{"$f":"(U4+X4)*Z4","v":4741.9394879999991},null,{"$f":"ROUND(U4+X4+AA4,2)","v":26296.21}]
[null,null,null,null,null,null,null,null,null,null,null,null,null,null,null,null,null,null,"Coord.SicurezzaEsec.",null,4000,null,0.04,160,null,0.22,915.2,null,{"$f":"ROUND(U5+X5+AA5,2)","v":5075.2}]
[null,null,null,null,null,"Imponibile","%iva","IVA","Importo",null,null,null,null,null,null,null,null,null,"Ape Post",null,1028.45,null,0.04,41.138000000000005,null,0.22,235.30936,null,{"$f":"ROUND(U6+X6+AA6,2)","v":1304.9000000000001}]
[null,null,"Importo complessivo Lavori",null,null,483318,0.1,{"$f":"F7*G7","v":48331.8},{"$f":"F7+H7","v":531649.80000000005},{"$f":"IF(ABS(H40-F7)>0.01,\"Importo Lavori non corretto - completare Tabella 2\",\"V.\")","v":"V."},null,null,null,null,null,null,null,null,null,null,null,null,0.04,0,null,0,0,null,{"$f":"ROUND(U7+X7+AA7,2)","v":0}]
[null,null,"di cui Oneri/Lavori x Sicurezza",null,6.1400000000000003E-2,{"$f":"E8*F7","v":29675.725200000001},{"$f":"G7","v":0.1},{"$f":"F8*G8","v":2967.5725200000002},{"$f":"F8+H8","v":32643.297720000002},{"$f":"IF(ABS(G40-F8)>0.01,\"Importo Sicurezza non corretto - completare Tabella 2 oppure Click su Proporzionale\",\"V.\")","v":"V."},null,null,null,null,null,null,null,null,null,null,null,null,0.04,0,null,0,0,null,0]
[null,null,"Importo Lavori al netto della Sicurezza",null,null,{"$f":"F7-F8","v":453642.27480000001},{"$f":"G7","v":0.1},{"$f":"F9*G9","v":45364.227480000001},{"$f":"F9+H9","v":499006.50228000002},{"$f":"IF(ABS(F40-F9)>0.01,\"Importo b.a. non corretto - completare Tabella 2\",\"V.\")","v":"V."},null,null,null,null,null,null,null,null,null,null,null,null,0.04,{"$f":"U9*W9","v":0},null,0,{"$f":"(U9+X9)*Z9","v":0},null,{"$f":"ROUND(U9+X9+AA9,2)","v":0}]
[null,null,"Spese tecniche (compresa iva)",null,null,{"$f":"AC13","v":39824.899999999994},null,null,{"$f":"AC13","v":39824.899999999994},{"$f":"IF(ABS(I10-K40)>0.01,\"Importo Spese Tecniche non corretto - completare Tabella 2 oppure Click su Proporzionale\",\"V.\")","v":"V."},null,null,null,null,null,null,null,null,null,null,null,{"$f":"SUM(U3:V9)","v":26554.66},null,{"$f":"SUM(X3:Y9)","v":1062.1864},null,null,{"$f":"SUM(AA3:AB9)","v":6075.7062079999987},null,{"$f":"SUM(AC3:AC9)","v":33692.559999999998},null,"Ripartire ad Interventi 110 ed Interventi Ristrutturazione"]
[null,null,null,null,null,null,null,null,{"$f":"I7+I10","v":571474.70000000007},{"$f":"IF(ABS(L40-I11)<=0.01,\"V.\",\"Importo Lavori non corretto - Correggere Imponibili Tabella 1 oppure Completare Tabella 2\")","v":"V."},null,null,null,null,null,null,null,null,null,null,"imponibile",null,"c.cassa",null,null,"iva",null,null,"totale"]
[null,null,null,null,null,null,null,null,null,null,null,null,null,null,null,null,null,null,"Visto Conformità",null,0.01,{"$f":"U12*H34","v":4833.1799488600045},0.04,{"$f":"V12*W12","v":193.32719795440019},null,0.22,{"$f":"(V12+X12)*Z12","v":1105.8315722991692},null,{"$f":"ROUND(V12+X12+AA12,2)","v":6132.34},null,"Ripartire solo ad Interventi 110"]
[null,null,null,null,null,null,null,null,null,null,null,null,null,null,null,null,null,null,null,null,{"$f":"V10+V12","v":31387.839948860004},null,null,{"$f":"X10+X12","v":1255.5135979544002},null,null,{"$f":"AA10+AA12","v":7181.5377802991679},null,{"$f":"AC10+AC12","v":39824.899999999994}]
[null,null,null,null,null,null,null,null,null,null,null,null,null,null,null,null,null,null,null,null,null,null,null,null,null,null,null,null,null,null,"Se Dichiarazione Fornitore"]
[null,null,"Lavorazione",null,null,"Importo Lavori","Incidenza Sicurezza","Imponibile","Iva","Importo c.iva","Spese tecniche","Totale","Sup. Interv.","Costo Unitario","Detrazione Spettante",null,null,null,"Massimale  spesa","Verifica Max",null,"Quota Eccedente Massimali Spesa ",null,"Cessione Credito",null,null,null,null,null,null,"Massimale costo","Verifica Costo Un."]
[null,null,"Isolamento pareti perimetrali",null,"Esterno",0,0,{"$f":"SUM(F16:G16)","v":0},{"$f":"F16*$G$9+G16*$G$8","v":0},{"$f":"H16+I16","v":0},0,{"$f":"SUM(J16:K16)","v":0},50,{"$f":"IF(ISNUMBER(M16)=TRUE,F16/M16,0)","v":0},{"$f":"IF(L16<=S16,L16*1.1,S16*1.1)","v":0},null,null,null,{"$f":"IF(TipoEdif=\"Edificio Unifamiliare\",50000,IF(N_Uimm>8,40000*8+30000*(N_Uimm-8),40000*N_Uimm))","v":120000},{"$f":"IF(L16>O16,\"KO Tot.>Detr.\",IF(L16>S16,\"ok< Tot.>Max.\",\"ok\"))","v":"ok"},null,null,null,"Quota Impresa",null,"Quota Tecnico",null,null,null,null,{"$f":"IF(Q16=\"Parete Ventilata\",200,IF(Q16=\"Interno\",80,150))","v":150},{"$f":"IF(AE16<>0,IF(N16>AE16,\"KO\",\"ok\"),\"ok\")","v":"ok"}]
[null,null,"Isolamento coperture",null,"Esterno",0,0,{"$f":"SUM(F17:G17)","v":0},{"$f":"F17*$G$9+G17*$G$8","v":0},{"$f":"H17+I17","v":0},0,{"$f":"SUM(J17:K17)","v":0},null,{"$f":"IF(ISNUMBER(M17)=TRUE,F17/M17,0)","v":0},0,null,null,null,{"$f":"IF(TipoEdif=\"Edificio Unifamiliare\",50000,IF(N_Uimm>8,40000*8+30000*(N_Uimm-8),40000*N_Uimm))","v":120000},"ok",null,null,null,null,null,null,null,null,null,null,{"$f":"IF(Q17=\"Copertura Ventilata\",250,IF(Q17=\"Interno\",100,230))","v":230},{"$f":"IF(AE17<>0,IF(N17>AE17,\"KO\",\"ok\"),\"ok\")","v":"ok"}]
[null,null,"Isolamento Pavimenti",null,"Esterno",null,0,0,0,{"$f":"H18+I18","v":0},0,{"$f":"SUM(J18:K18)","v":0},null,0,0,null,null,null,{"$f":"IF(TipoEdif=\"Edificio Unifamiliare\",50000,IF(N_Uimm>8,40000*8+30000*(N_Uimm-8),40000*N_Uimm))","v":120000},"ok",null,null,null,null,null,null,null,null,null,null,{"$f":"IF(Q18=\"Interno/terreno\",150,120)","v":120},"ok"]
[null,null,"Isolamento sup. verticali e/o orizzontali",null,null,{"$f":"SUM(F16:F18)","v":0},{"$f":"SUM(G16:G18)","v":0},0,0,0,0,0,null,null,0,null,null,null,{"$f":"IF(TipoEdif=\"Edificio Unifamiliare\",50000,IF(N_Uimm>8,40000*8+30000*(N_Uimm-8),40000*N_Uimm))","v":120000},"ok",null,{"$f":"IF(L19>S19,L19-S19,0)","v":0},null,{"$f":"IF(O19<>0,J19*O19/L19,0)","v":0},null,{"$f":"IF(O19<>0,K19*O19/L19,0)","v":0}]
[null,null,"Serramenti",null,"Zone D, E ed F",null,0,0,{"$f":"F20*$G$9+G20*$G$8","v":0},{"$f":"H20+I20","v":0},0,{"$f":"SUM(J20:K20)","v":0},null,0,0,null,null,null,{"$f":"60000*N_Uimm/1.1","v":163636.36363636362},"ok",null,null,null,0,null,0,null,null,null,null,{"$f":"IF(Q20=\"Zone A, B e C\",550,650)","v":650},{"$f":"IF(AE20<>0,IF(N20>AE20,\"KO\",\"ok\"),\"ok\")","v":"ok"}]
[null,null,"Serramenti con chiusure oscuranti",null,"Zone D, E ed F",0,0,0,0,0,0,{"$f":"SUM(J21:K21)","v":0},null,0,0,null,null,null,{"$f":"60000*N_Uimm/1.1","v":163636.36363636362},"ok",null,null,null,0,null,0,null,null,null,null,{"$f":"IF(Q21=\"Zone A, B e C\",650,750)","v":750},"ok"]
[null,null,"Serramenti + chiusure oscuranti",null,null,{"$f":"SUM(F20:F21)","v":0},0,0,0,0,0,0,null,null,0,null,null,null,{"$f":"60000*N_Uimm/1.1","v":163636.36363636362},"ok",null,{"$f":"IF(L22>S22,L22-S22,0)","v":0},null,{"$f":"IF(O22<>0,J22*O22/L22,0)","v":0},null,{"$f":"IF(O22<>0,K22*O22/L22,0)","v":0}]
[null,null,"Schermature solari ",null,null,0,0,{"$f":"SUM(F23:G23)","v":0},0,0,0,{"$f":"SUM(J23:K23)","v":0},null,0,0,null,null,null,{"$f":"60000*N_Uimm/1.1","v":163636.36363636362},"ok",null,0,null,0,null,0,null,null,null,null,230,{"$f":"IF(AE23<>0,IF(N23>AE23,\"KO\",\"ok\"),\"ok\")","v":"ok"}]
[null,null,"Solare Termico    - con collettori solari",null,"Piani Vetrati",0,0,0,0,0,0,0,null,0,0,null,null,null,{"$f":"IF(TipoEdif=\"Edificio Unifamiliare\",30000,IF(N_Uimm>8,15000*N_Uimm,20000*N_Uimm))","v":60000},"ok",null,0,null,0,null,0,null,null,null,null,{"$f":"IF(Q24=\"Scoperti\",750,IF(Q24=\"Piani vetrati\",1000,1250))","v":1250},"ok"]
[null,null,"Solare Fotovoltaico                       kWp",null,6,0,0,0,0,0,0,0,null,0,0,null,null,null,{"$f":"IF(C25=\"Solare Fotovoltaico                       kWp\",IF(E25*2400<48000*N_Uimm,E25*2400,48000*N_Uimm),IF(E25*1600<48000*N_Uimm,E25*1600,48000*N_Uimm))","v":14400},{"$f":"IF(L25>O25,\"KO Tot.>Detr.\",IF(L25>S25,\"ok< Tot.>Max.\",\"ok\"))","v":"ok"},null,0,null,0,null,0,null,null,null,null,"vedi All.I","ok"]
[null,null,"Sistema di Accumulo                     kWh",null,10,0,0,0,0,0,0,0,null,0,0,null,null,null,{"$f":"IF(E26*1000<48000*N_Uimm,E26*1000,48000*N_Uimm)","v":10000},{"$f":"IF(L26>O26,\"KO Tot.>Detr.\",IF(L26>S26,\"ok< Tot.>Max.\",\"ok\"))","v":"ok"},null,0,null,0,null,0,null,null,null,null,"vedi All.I","ok"]
[null,null,"Impianti climatizzazione e ACS",null,null,0,0,{"$f":"SUM(F27:G27)","v":0},0,0,0,0,null,0,0,null,null,null,{"$f":"IF(TipoEdif=\"Edificio Unifamiliare\",30000,IF(N_Uimm>8,20000*8+15000*(N_Uimm-8),20000*N_Uimm))","v":60000},"ok",null,0,null,0,null,0,null,null,null,null,"vedi All.I","vedi All.I"]
[null,null,"Sistemi di Microgenerazione",null,null,0,0,{"$f":"SUM(F28:G28)","v":0},{"$f":"F28*$G$9+G28*$G$8","v":0},{"$f":"H28+I28","v":0},0,{"$f":"SUM(J28:K28)","v":0},null,{"$f":"IF(ISNUMBER(M28)=TRUE,F28/M28,0)","v":0},0,null,null,null,{"$f":"100000*N_Uimm/1.1","v":272727.27272727271},"ok",null,0,null,0,null,0]
[null,null,"Impianti Biomassa",null,null,0,0,0,0,0,0,0,null,0,0,null,null,null,{"$f":"30000*N_Uimm/1.1","v":81818.181818181809},"ok",null,0,null,0,null,0,null,null,null,null,"vedi All.I","vedi All.I"]
[null,null,"Sistemi di Building Automation",null,null,0,0,0,0,0,0,0,null,0,0,null,null,null,{"$f":"15000/1.1*N_Uimm","v":40909.090909090912},"ok",null,0,null,0,null,0,null,null,null,null,50,{"$f":"IF(AE30<>0,IF(N30>AE30,\"KO\",\"ok\"),\"ok\")","v":"ok"}]
[null,null,"Colonnine di Ricarica",null,null,0,0,0,0,0,0,0,null,0,0,null,null,null,{"$f":"IF(TipoEdif=\"Edificio Unifamiliare\",2000,IF(N_Uimm>8,1200*N_Uimm,1500*N_Uimm))","v":4500},"ok",null,0,null,0,null,0,null,null,null,null,null,"ok"]
[null,null,"Eliminazione Barriere architettoniche",null,null,93860,6139.9999999999991,{"$f":"SUM(F32:G32)","v":100000},{"$f":"F32*$G$9+G32*$G$8","v":10000},110000,8239.8955630661385,118239.89556306614,null,0,0,null,null,null,{"$f":"IF(F32>0,IF(105600*N_Uimm/1.1 > L33,105600*N_Uimm/1.1 - L33,0),105600*N_Uimm/1.1 )","v":0},"KO Tot.>Detr.",null,118239.89556306614,null,0,null,0,null,null,null,null,null,"ok"]
[null,null,"SismaBonus",null,null,359782.27,23535.724886000415,383317.99488600041,38331.799488600045,421649.79437460046,31585.002454199188,453234.79682879965,null,0,316800,null,null,null,{"$f":"105600*N_Uimm/1.1","v":288000},"KO Tot.>Detr.",null,165234.79682879965,null,294722.85842238652,null,22077.141577613507,null,null,null,null,null,"ok"]
[null,null,"Totale interventi 110  ",null,null,{"$f":"F19+F22+SUM(F23:F33)","v":453642.27},29675.724886000415,483317.99488600041,48331.799488600045,531649.79437460052,39824.898017265325,571474.69239186577,null,null,{"$f":"O19+O22+SUM(O23:O33)","v":316800},null,null,null,null,null,null,{"$f":"SUM(V19:W33)","v":283474.69239186577},null,{"$f":"SUM(X19:Y33)","v":294722.85842238652},null,{"$f":"SUM(Z19:AA33)","v":22077.141577613507}]
[]
[null,null,"Lavori Ristrutturazione",null,0,0,0,{"$f":"SUM(F36:G36)","v":0},{"$f":"F36*$G$9+G36*$G$8","v":0},{"$f":"H36+I36","v":0},0,{"$f":"SUM(J36:K36)","v":0},null,{"$f":"IF(ISNUMBER(M36)=TRUE,H36/M36,0)","v":0},{"$f":"IF(L36<=S36,L36*E36,S36*E36)","v":0},null,null,null,{"$f":"96000*N_Uimm","v":288000},{"$f":"IF(S36<>0,IF(L36>S36,\"KO\",\"ok\"),\"ok\")","v":"ok"},null,null,null,{"$f":"IF(O36<>0,J36*O36/L36,0)","v":0},null,{"$f":"IF(O36<>0,K36*O36/L36,0)","v":0},null,null,null,null,0,{"$f":"IF(AE36<>0,IF(N36>AE36,\"KO\",\"ok\"),\"ok\")","v":"ok"}]
[null,null,null,null,0,0,0,0,0,{"$f":"H37+I37","v":0},0,0,null,{"$f":"IF(ISNUMBER(M37)=TRUE,H37/M37,0)","v":0},{"$f":"IF(L37<=S37,L37*E37,S37*E37)","v":0},null,null,null,{"$f":"96000*N_Uimm","v":288000},{"$f":"IF(S37<>0,IF(L37>S37,\"KO\",\"ok\"),\"ok\")","v":"ok"},null,null,null,{"$f":"IF(O37<>0,J37*O37/L37,0)","v":0},null,{"$f":"IF(O37<>0,K37*O37/L37,0)","v":0},null,null,null,null,0,"ok"]
[null,null,"Totale Altri Interventi  ",null,null,{"$f":"SUM(F36:F37)","v":0},{"$f":"SUM(G36:G37)","v":0},{"$f":"SUM(H36:H37)","v":0},{"$f":"SUM(I36:I37)","v":0},{"$f":"SUM(J36:J37)","v":0},0,0,null,null,{"$f":"SUM(O36:O37)","v":0},null,null,null,null,null,null,null,null,{"$f":"SUM(X36:Y37)","v":0},null,{"$f":"SUM(Z36:AA37)","v":0}]
[]
[null,null,"Totali x verifica",null,null,{"$f":"F34+F38","v":453642.27},{"$f":"G34+G38","v":29675.724886000415},483317.99488600041,{"$f":"I34+I38","v":48331.799488600045},{"$f":"J34+J38","v":531649.79437460052},39824.898017265325,{"$f":"L34+L38","v":571474.69239186577},null,"Totale Generale",{"$f":"O34+O38","v":316800},null,null,null,null,null,null,null,null,{"$f":"X34+X38","v":294722.85842238652},null,{"$f":"Z34+Z38","v":22077.141577613507}]
[]
[]
[null,null,null,null,null,null,"Quota % effettiva per cessione credito a Banca o Impresa Interventi 110:",{"$f":"100/110","v":0.90909090909090906},{"$f":"H43*110","v":100}]
[null,null,null,null,null,null,"Quota % effettiva per cessione credito a Banca o Impresa Interventi NO 110:",0.875,{"$f":"H44*100","v":87.5},"Quota Impresa","Quota Tecnici"]
[null,null,null,null,null,null,"Netto a seguito Cessione Credito a Banca/Impresa :",{"$f":"H43*O34+H44*O38","v":288000},null,{"$f":"X40*H45/O40","v":267929.8712930787},{"$f":"Z40*H45/O40","v":20070.128706921369}]
[null,null,null,null,null,null,"Quota a carico cliente :",{"$f":"L40-H45","v":283474.69239186577},null,{"$f":"H46*X40/O40","v":263719.92308124184},{"$f":"H46*Z40/O40","v":19754.769310623924}]

{"sheet":"SAL.30%","index":2,"n_rows":43,"n_cols":20,"rows_kept":43,"cut":false,"hidden":false,"merged":[[32,2,32,3],[33,10,33,13],[39,15,39,18],[39,2,39,3],[39,4,39,5],[36,4,36,5],[38,2,38,3],[38,4,38,5],[36,2,36,3],[18,2,18,3],[18,4,18,5],[19,2,19,3],[19,4,19,5],[21,2,21,3],[21,4,21,5],[20,2,20,3],[20,4,20,5],[15,2,15,3],[15,4,15,5],[16,2,16,3],[16,4,16,5],[17,2,17,3],[17,4,17,5],[13,2,13,3],[13,4,13,5],[14,2,14,3],[2,2,2,3],[2,5,2,8],[3,2,3,3],[3,5,3,8],[4,2,4,4],[14,4,14,5],[12,2,12,3],[12,4,12,5],[5,2,5,3],[5,4,5,5],[8,2,8,3],[8,4,8,5],[9,2,9,3],[9,4,9,5],[6,2,6,3],[6,4,6,5],[7,2,7,3],[7,4,7,5],[42,4,42,5],[26,2,26,3],[30,2,30,3],[26,4,26,5],[30,4,30,5],[27,2,27,3],[27,4,27,5],[28,2,28,3],[28,4,28,5],[29,2,29,3],[29,4,29,5],[31,2,31,3],[31,4,31,5],[32,4,32,5],[34,4,34,5],[35,4,35,5],[22,2,22,3],[22,4,22,5],[23,4,23,5],[24,4,24,5],[25,2,25,3],[25,4,25,5]]}
[]
[]
[null,null,"STATO AVANZAMENTO LAVORI N.1",null,null,{"$f":"'Dati Gen'!B28","v":0},null,null,null,null,null,null,null,{"$f":"'Dati Gen'!I3","v":"©2021 SIM srl - www.madosoft.it"}]
[null,null,"26/06/2021",null,null,{"$f":"'Dati Gen'!B29","v":0},null,null,null,null,null,null,null,{"$f":"'Dati Gen'!I2","v":"Pratica.110"}]
[]
[null,null,null,null,"Imponibile",null,"%iva","IVA","Importo"]
[null,null,{"$f":"'Computo-Massimali'!C7","v":"Importo complessivo Lavori"},null,{"$f":"'Computo-Massimali'!F7","v":483318},null,{"$f":"'Computo-Massimali'!G7","v":0.1},{"$f":"'Computo-Massimali'!H7","v":48331.8},{"$f":"'Computo-Massimali'!I7","v":531649.80000000005}]
[null,null,{"$f":"'Computo-Massimali'!C8","v":"di cui Oneri/Lavori x Sicurezza"},null,{"$f":"'Computo-Massimali'!F8","v":29675.725200000001},null,{"$f":"'Computo-Massimali'!G8","v":0.1},{"$f":"'Computo-Massimali'!H8","v":2967.5725200000002},{"$f":"'Computo-Massimali'!I8","v":32643.297720000002}]
[null,null,{"$f":"'Computo-Massimali'!C9","v":"Importo Lavori al netto della Sicurezza"},null,{"$f":"'Computo-Massimali'!F9","v":453642.27480000001},null,{"$f":"'Computo-Massimali'!G9","v":0.1},{"$f":"'Computo-Massimali'!H9","v":45364.227480000001},{"$f":"'Computo-Massimali'!I9","v":499006.50228000002}]
[null,null,{"$f":"'Computo-Massimali'!C10","v":"Spese tecniche (compresa iva)"},null,{"$f":"'Computo-Massimali'!F10","v":39824.899999999994},null,{"$f":"'Computo-Massimali'!G10","v":0},{"$f":"'Computo-Massimali'!H10","v":0},{"$f":"'Computo-Massimali'!I10","v":39824.899999999994}]
[null,null,null,null,null,null,null,null,{"$f":"'Computo-Massimali'!I11","v":571474.70000000007}]
[null,null,"Lavori Eseguiti"]
[null,null,"Oneri/Lavori x Sicurezza",null,6866.28]
[null,null,"Lavorazione",null,"Importo Lavori Eseguiti  ",null,"Incidenza Sicurezza","Imponibile","Iva","Importo c.iva","Spese tecniche","Totale","% SAL","Detrazione ",null,null,{"$f":"'Computo-Massimali'!S15","v":"Massimale  spesa"},null,"Ripartizione Spese Tecniche","Fatturare"]
[null,null,{"$f":"'Computo-Massimali'!C16","v":"Isolamento pareti perimetrali"},null,19759.2,null,{"$f":"IF('Computo-Massimali'!F16<>0,'Computo-Massimali'!G16*E15/'Computo-Massimali'!F16,0)","v":0},{"$f":"SUM(E15:G15)","v":19759.2},{"$f":"H15*'Computo-Massimali'!$G$9","v":1975.92},{"$f":"SUM(H15:I15)","v":21735.120000000003},{"$f":"IF('Computo-Massimali'!F16<>0,'Computo-Massimali'!K16*E15/'Computo-Massimali'!F16,0)","v":0},{"$f":"SUM(J15:K15)","v":21735.120000000003},{"$f":"IF(L15>0,L15/'Computo-Massimali'!L16,0)","v":{"$error":"#DIV/0!"}},{"$f":"IF(L15<=Q15,L15*1.1,Q15*1.1)","v":23908.632000000005},null,null,{"$f":"'Computo-Massimali'!S16","v":120000},null,{"$f":"IF('Computo-Massimali'!S3<>0,'Computo-Massimali'!S3,\"-\")","v":"Ape Ante"},{"$f":"$K$40*'Computo-Massimali'!AC3/'Computo-Massimali'!$AC$13","v":0}]
[null,null,{"$f":"'Computo-Massimali'!C17","v":"Isolamento coperture"},null,14499.84,null,{"$f":"IF('Computo-Massimali'!F17<>0,'Computo-Massimali'!G17*E16/'Computo-Massimali'!F17,0)","v":0},{"$f":"SUM(E16:G16)","v":14499.84},{"$f":"H16*'Computo-Massimali'!$G$9","v":1449.9840000000002},{"$f":"SUM(H16:I16)","v":15949.824000000001},{"$f":"IF('Computo-Massimali'!F17<>0,'Computo-Massimali'!K17*E16/'Computo-Massimali'!F17,0)","v":0},{"$f":"SUM(J16:K16)","v":15949.824000000001},{"$f":"IF(L16>0,L16/'Computo-Massimali'!L17,0)","v":{"$error":"#DIV/0!"}},17544.806400000001,null,null,{"$f":"'Computo-Massimali'!S17","v":120000},null,{"$f":"IF('Computo-Massimali'!S4<>0,'Computo-Massimali'!S4,\"-\")","v":"Progettazione e DL"},{"$f":"$K$40*'Computo-Massimali'!AC4/'Computo-Massimali'!$AC$13","v":0}]
[null,null,{"$f":"'Computo-Massimali'!C18","v":"Isolamento Pavimenti"},null,0,null,{"$f":"IF('Computo-Massimali'!F18<>0,'Computo-Massimali'!G18*E17/'Computo-Massimali'!F18,0)","v":0},0,{"$f":"H17*'Computo-Massimali'!$G$9","v":0},0,{"$f":"IF('Computo-Massimali'!F18<>0,'Computo-Massimali'!K18*E17/'Computo-Massimali'!F18,0)","v":0},0,{"$f":"IF(L17>0,L17/'Computo-Massimali'!L18,0)","v":0},0,null,null,{"$f":"'Computo-Massimali'!S18","v":120000},null,{"$f":"IF('Computo-Massimali'!S5<>0,'Computo-Massimali'!S5,\"-\")","v":"Coord.SicurezzaEsec."},{"$f":"$K$40*'Computo-Massimali'!AC5/'Computo-Massimali'!$AC$13","v":0}]
[null,null,{"$f":"'Computo-Massimali'!C19","v":"Isolamento sup. verticali e/o orizzontali"},null,{"$f":"SUM(E15:F17)","v":34259.040000000001},null,{"$f":"SUM(G15:G17)","v":0},{"$f":"SUM(H15:H17)","v":34259.040000000001},{"$f":"SUM(I15:I17)","v":3425.9040000000005},{"$f":"SUM(J15:J17)","v":37684.944000000003},{"$f":"SUM(K15:K17)","v":0},{"$f":"IF('Dati Gen'!P17=\"Versione DEMO\",\"Versione DEMO\",SUM(J18:K18))","v":"Versione DEMO"},{"$f":"IF(L18>0,L18/'Computo-Massimali'!L19,0)","v":{"$error":"#VALUE!"}},132000,null,null,{"$f":"'Computo-Massimali'!S19","v":120000},null,{"$f":"IF('Computo-Massimali'!S6<>0,'Computo-Massimali'!S6,\"-\")","v":"Ape Post"},{"$f":"$K$40*'Computo-Massimali'!AC6/'Computo-Massimali'!$AC$13","v":0}]
[null,null,{"$f":"'Computo-Massimali'!C20","v":"Serramenti"},null,0,null,{"$f":"IF('Computo-Massimali'!F20<>0,'Computo-Massimali'!G20*E19/'Computo-Massimali'!F20,0)","v":0},0,{"$f":"H19*'Computo-Massimali'!$G$9","v":0},0,{"$f":"IF('Computo-Massimali'!F20<>0,'Computo-Massimali'!K20*E19/'Computo-Massimali'!F20,0)","v":0},0,{"$f":"IF(L19>0,L19/'Computo-Massimali'!L20,0)","v":0},0,null,null,{"$f":"'Computo-Massimali'!S20","v":163636.36363636362},null,{"$f":"IF('Computo-Massimali'!T7<>0,'Computo-Massimali'!T7,\"-\")","v":"-"},{"$f":"$K$40*'Computo-Massimali'!AC7/'Computo-Massimali'!$AC$13","v":0}]
[null,null,{"$f":"'Computo-Massimali'!C21","v":"Serramenti con chiusure oscuranti"},null,1589.3,null,{"$f":"IF('Computo-Massimali'!F21<>0,'Computo-Massimali'!G21*E20/'Computo-Massimali'!F21,0)","v":0},1589.3,{"$f":"H20*'Computo-Massimali'!$G$9","v":158.93},1748.23,{"$f":"IF('Computo-Massimali'!F21<>0,'Computo-Massimali'!K21*E20/'Computo-Massimali'!F21,0)","v":0},1748.23,{"$f":"IF(L20>0,L20/'Computo-Massimali'!L21,0)","v":{"$error":"#DIV/0!"}},1923.0530000000001,null,null,{"$f":"'Computo-Massimali'!S21","v":163636.36363636362},null,{"$f":"IF('Computo-Massimali'!T8<>0,'Computo-Massimali'!T8,\"-\")","v":"-"},{"$f":"$K$40*'Computo-Massimali'!AC8/'Computo-Massimali'!$AC$13","v":0}]
[null,null,"Serramenti + chiusure oscuranti",null,{"$f":"SUM(E19:F20)","v":1589.3},null,{"$f":"SUM(G19:G20)","v":0},1589.3,158.93,1748.23,0,1748.23,{"$f":"IF(L21>0,L21/'Computo-Massimali'!L22,0)","v":{"$error":"#DIV/0!"}},1923.0530000000001,null,null,{"$f":"'Computo-Massimali'!S22","v":163636.36363636362},null,{"$f":"IF('Computo-Massimali'!T9<>0,'Computo-Massimali'!T9,\"-\")","v":"-"},{"$f":"$K$40*'Computo-Massimali'!AC9/'Computo-Massimali'!$AC$13","v":0}]
[null,null,{"$f":"'Computo-Massimali'!C23","v":"Schermature solari "},null,0,null,{"$f":"IF('Computo-Massimali'!F23<>0,'Computo-Massimali'!G23*E22/'Computo-Massimali'!F23,0)","v":0},0,{"$f":"H22*'Computo-Massimali'!$G$9","v":0},0,{"$f":"IF('Computo-Massimali'!F23<>0,'Computo-Massimali'!K23*E22/'Computo-Massimali'!F23,0)","v":0},0,{"$f":"IF(L22>0,L22/'Computo-Massimali'!L23,0)","v":0},0,null,null,{"$f":"'Computo-Massimali'!S23","v":163636.36363636362},null,{"$f":"IF('Computo-Massimali'!S12<>0,'Computo-Massimali'!S12,\"-\")","v":"Visto Conformità"},{"$f":"$K$40*'Computo-Massimali'!AC12/'Computo-Massimali'!$AC$13","v":0}]
[null,null,{"$f":"'Computo-Massimali'!C24","v":"Solare Termico    - con collettori solari"},null,0,null,{"$f":"IF('Computo-Massimali'!F24<>0,'Computo-Massimali'!G24*E23/'Computo-Massimali'!F24,0)","v":0},0,{"$f":"H23*'Computo-Massimali'!$G$9","v":0},0,{"$f":"IF('Computo-Massimali'!F24<>0,'Computo-Massimali'!K24*E23/'Computo-Massimali'!F24,0)","v":0},0,{"$f":"IF(L23>0,L23/'Computo-Massimali'!L24,0)","v":0},0,null,null,{"$f":"'Computo-Massimali'!S24","v":60000},null,null,{"$f":"SUM(T15:T22)","v":0}]
[null,null,{"$f":"MID('Computo-Massimali'!C25,1,28) &\"    kWp\"","v":"Solare Fotovoltaico             kWp"},{"$f":"'Computo-Massimali'!E25","v":6},7080,null,{"$f":"IF('Computo-Massimali'!F25<>0,'Computo-Massimali'!G25*E24/'Computo-Massimali'!F25,0)","v":0},7080,{"$f":"H24*'Computo-Massimali'!$G$9","v":708},7788,{"$f":"IF('Computo-Massimali'!F25<>0,'Computo-Massimali'!K25*E24/'Computo-Massimali'!F25,0)","v":0},7788,{"$f":"IF(L24>0,L24/'Computo-Massimali'!L25,0)","v":{"$error":"#DIV/0!"}},8566.8000000000011,null,null,{"$f":"'Computo-Massimali'!S25","v":14400}]
[null,null,{"$f":"MID('Computo-Massimali'!C26,1,28)&\"     kWh\"","v":"Sistema di Accumulo              kWh"},{"$f":"'Computo-Massimali'!E26","v":10},0,null,{"$f":"IF('Computo-Massimali'!F26<>0,'Computo-Massimali'!G26*E25/'Computo-Massimali'!F26,0)","v":0},0,{"$f":"H25*'Computo-Massimali'!$G$9","v":0},0,{"$f":"IF('Computo-Massimali'!F26<>0,'Computo-Massimali'!K26*E25/'Computo-Massimali'!F26,0)","v":0},0,{"$f":"IF(L25>0,L25/'Computo-Massimali'!L26,0)","v":0},0,null,null,{"$f":"'Computo-Massimali'!S26","v":10000}]
[null,null,{"$f":"'Computo-Massimali'!C27","v":"Impianti climatizzazione e ACS"},null,0,null,{"$f":"IF('Computo-Massimali'!F27<>0,'Computo-Massimali'!G27*E26/'Computo-Massimali'!F27,0)","v":0},0,{"$f":"H26*'Computo-Massimali'!$G$9","v":0},0,{"$f":"IF('Computo-Massimali'!F27<>0,'Computo-Massimali'!K27*E26/'Computo-Massimali'!F27,0)","v":0},{"$f":"IF('Dati Gen'!P17=\"Versione DEMO\",\"Versione DEMO\",SUM(J26:K26))","v":"Versione DEMO"},{"$f":"IF(L26>0,L26/'Computo-Massimali'!L27,0)","v":{"$error":"#VALUE!"}},66000,null,null,{"$f":"'Computo-Massimali'!S27","v":60000}]
[null,null,{"$f":"'Computo-Massimali'!C28","v":"Sistemi di Microgenerazione"},null,0,null,{"$f":"IF('Computo-Massimali'!F28<>0,'Computo-Massimali'!G28*E27/'Computo-Massimali'!F28,0)","v":0},{"$f":"SUM(E27:G27)","v":0},{"$f":"H27*'Computo-Massimali'!$G$9","v":0},{"$f":"SUM(H27:I27)","v":0},{"$f":"IF('Computo-Massimali'!F28<>0,'Computo-Massimali'!K28*E27/'Computo-Massimali'!F28,0)","v":0},{"$f":"SUM(J27:K27)","v":0},{"$f":"IF(L27>0,L27/'Computo-Massimali'!L28,0)","v":0},{"$f":"IF(L27<=Q27,L27*1.1,Q27*1.1)","v":0},null,null,{"$f":"'Computo-Massimali'!S28","v":272727.27272727271}]
[null,null,{"$f":"'Computo-Massimali'!C29","v":"Impianti Biomassa"},null,0,null,{"$f":"IF('Computo-Massimali'!F29<>0,'Computo-Massimali'!G29*E28/'Computo-Massimali'!F29,0)","v":0},0,{"$f":"H28*'Computo-Massimali'!$G$9","v":0},0,{"$f":"IF('Computo-Massimali'!F29<>0,'Computo-Massimali'!K29*E28/'Computo-Massimali'!F29,0)","v":0},0,{"$f":"IF(L28>0,L28/'Computo-Massimali'!L29,0)","v":0},0,null,null,{"$f":"'Computo-Massimali'!S29","v":81818.181818181809}]
[null,null,{"$f":"'Computo-Massimali'!C30","v":"Sistemi di Building Automation"},null,0,null,{"$f":"IF('Computo-Massimali'!F30<>0,'Computo-Massimali'!G30*E29/'Computo-Massimali'!F30,0)","v":0},0,{"$f":"H29*'Computo-Massimali'!$G$9","v":0},0,{"$f":"IF('Computo-Massimali'!F30<>0,'Computo-Massimali'!K30*E29/'Computo-Massimali'!F30,0)","v":0},0,{"$f":"IF(L29>0,L29/'Computo-Massimali'!L30,0)","v":0},0,null,null,{"$f":"'Computo-Massimali'!S30","v":40909.090909090912}]
[null,null,{"$f":"'Computo-Massimali'!C31","v":"Colonnine di Ricarica"},null,0,null,{"$f":"IF('Computo-Massimali'!F31<>0,'Computo-Massimali'!G31*E30/'Computo-Massimali'!F31,0)","v":0},0,{"$f":"H30*'Computo-Massimali'!$G$9","v":0},0,{"$f":"IF('Computo-Massimali'!F31<>0,'Computo-Massimali'!K31*E30/'Computo-Massimali'!F31,0)","v":0},0,{"$f":"IF(L30>0,L30/'Computo-Massimali'!L31,0)","v":0},0,null,null,{"$f":"'Computo-Massimali'!S31","v":4500}]
[null,null,{"$f":"'Computo-Massimali'!C32","v":"Eliminazione Barriere architettoniche"},null,0,null,{"$f":"IF('Computo-Massimali'!F32<>0,'Computo-Massimali'!G32*E31/'Computo-Massimali'!F32,0)","v":0},{"$f":"SUM(E31:G31)","v":0},{"$f":"H31*'Computo-Massimali'!$G$9","v":0},{"$f":"SUM(H31:I31)","v":0},{"$f":"IF('Computo-Massimali'!F32<>0,'Computo-Massimali'!K32*E31/'Computo-Massimali'!F32,0)","v":0},{"$f":"SUM(J31:K31)","v":0},{"$f":"IF(L31>0,L31/'Computo-Massimali'!L32,0)","v":0},{"$f":"IF(L31<=Q31,L31*1.1,Q31*1.1)","v":0},null,null,{"$f":"'Computo-Massimali'!S32","v":0}]
[null,null,{"$f":"'Computo-Massimali'!C33","v":"SismaBonus"},null,0,null,{"$f":"IF('Computo-Massimali'!F33<>0,'Computo-Massimali'!G33*E32/'Computo-Massimali'!F33,0)","v":0},0,{"$f":"H32*'Computo-Massimali'!$G$9","v":0},0,{"$f":"IF('Computo-Massimali'!F33<>0,'Computo-Massimali'!K33*E32/'Computo-Massimali'!F33,0)","v":0},0,{"$f":"IF(L32>0,L32/'Computo-Massimali'!L33,0)","v":0},0,null,null,{"$f":"'Computo-Massimali'!S33","v":288000}]
[null,null,"Totali SAL N.1 - Superbonus 110  ",null,{"$f":"E18+E21+SUM(E22:F32)","v":42928.340000000004},null,{"$f":"G18+G21+SUM(G22:G32)","v":0},{"$f":"H18+H21+SUM(H22:H32)","v":42928.340000000004},4292.8340000000007,47221.174000000006,0,{"$error":"#VALUE!"},{"$f":"IF(L33>0,L33/'Computo-Massimali'!L34,0)","v":{"$error":"#VALUE!"}},{"$f":"N18+N21+SUM(N22:N32)","v":208489.853}]
[null,null,null,null,null,null,null,null,null,null,{"$f":"IF(M33>=29.999%,\"\",\"SAL Superbonus 110 inferiore 30%\")","v":{"$error":"#VALUE!"}}]
[null,null,{"$f":"'Computo-Massimali'!C36","v":"Lavori Ristrutturazione"},0.5,3635.41,null,{"$f":"IF('Computo-Massimali'!F36<>0,'Computo-Massimali'!G36*E35/'Computo-Massimali'!F36,0)","v":0},{"$f":"SUM(E35:G35)","v":3635.41},{"$f":"H35*'Computo-Massimali'!$G$9","v":363.541},{"$f":"SUM(H35:I35)","v":3998.951},{"$f":"IF('Computo-Massimali'!F36<>0,'Computo-Massimali'!K36*E35/'Computo-Massimali'!F36,0)","v":0},{"$f":"SUM(J35:K35)","v":3998.951},{"$f":"IF(L35>0,L35/'Computo-Massimali'!L36,0)","v":{"$error":"#DIV/0!"}},{"$f":"IF(L35<=Q35*D35,L35*D35,U35*D35)","v":1999.4755},null,null,{"$f":"'Computo-Massimali'!S36","v":288000}]
[null,null,{"$f":"'Computo-Massimali'!C37","v":0},{"$f":"'Computo-Massimali'!E37","v":0},0,null,{"$f":"IF('Computo-Massimali'!F37<>0,'Computo-Massimali'!G37*E36/'Computo-Massimali'!F37,0)","v":0},0,{"$f":"H36*'Computo-Massimali'!$G$9","v":0},0,{"$f":"IF('Computo-Massimali'!F37<>0,'Computo-Massimali'!K37*E36/'Computo-Massimali'!F37,0)","v":0},0,{"$f":"IF(L36>0,L36/'Computo-Massimali'!L37,0)","v":0},{"$f":"IF(L36<=Q36*D36,L36*D36,U36*D36)","v":0},null,null,{"$f":"'Computo-Massimali'!S37","v":288000}]
[null,null,"Totali SAL N.1 - AltrI Interventi  ",null,{"$f":"SUM(E35:F36)","v":3635.41},null,{"$f":"SUM(G35:G36)","v":0},{"$f":"SUM(H35:H36)","v":3635.41},{"$f":"SUM(I35:I36)","v":363.541},{"$f":"SUM(J35:J36)","v":3998.951},0,3998.951,{"$f":"IF(L37>0,L37/'Computo-Massimali'!L38,0)","v":{"$error":"#DIV/0!"}},{"$f":"SUM(N35:N36)","v":1999.4755}]
[]
[null,null,null,null,{"$f":"E14","v":"Importo Lavori Eseguiti  "},null,"Incidenza Sicurezza","Imponibile",{"$f":"I14","v":"Iva"},"Importo c.iva","Spese tecniche","Totale","% SAL","Detrazione "]
[null,null,"Totali SAL N.1",null,{"$f":"E33+E37","v":46563.75},null,{"$f":"G33+G37","v":0},{"$f":"H33+H37","v":46563.75},{"$f":"I37+I33","v":4656.3750000000009},{"$f":"J37+J33","v":51220.125000000007},{"$f":"K37+K33","v":0},{"$f":"SUM(J40:K40)","v":51220.125000000007},{"$f":"IF(L40>0,L40/'Computo-Massimali'!L40,0)","v":8.9627984724261187E-2},{"$f":"N37+N33","v":210489.3285}]
[]
[null,null,{"$f":"IF(ABS(E13-G40)>0.01,\"Oneri/Lavori Sicurezza non imputabili al SAL, per lavori non eseguiti\",\"\")","v":"Oneri/Lavori Sicurezza non imputabili al SAL, per lavori non eseguiti"},null,null,null,{"$f":"IF(C42<>\"\",E13-G40,\"\")","v":6866.28}]
[null,null,{"$f":"IF($C$42<>\"\",\"Importo Effettivo Lavori Eseguiti\",\"\")","v":"Importo Effettivo Lavori Eseguiti"},null,{"$f":"IF($C$42<>\"\",E40,\"\")","v":46563.75},null,{"$f":"IF($C$42<>\"\",E13,\"\")","v":6866.28},{"$f":"IF($C$42<>\"\",E43+G43,\"\")","v":53430.03},{"$f":"IF($C$42<>\"\",H43*G9,\"\")","v":5343.0030000000006},{"$f":"IF($C$42<>\"\",H43+I43,\"\")","v":58773.032999999996},{"$f":"IF($C$42<>\"\",K40,\"\")","v":0},{"$f":"IF($C$42<>\"\",J43+K43,\"\")","v":58773.032999999996},{"$f":"IF($C$42<>\"\",L43/'Computo-Massimali'!L40,\"\")","v":0.10284450699646863},{"$f":"IF($C$42<>\"\",L43*1.1,\"\")","v":64650.336300000003}]

{"sheet":"SAL.60%","index":3,"n_rows":43,"n_cols":21,"rows_kept":43,"cut":false,"hidden":false,"merged":[[39,15,39,18],[35,4,35,5],[36,4,36,5],[38,2,38,3],[38,4,38,5],[39,2,39,3],[39,4,39,5],[36,2,36,3],[20,2,20,3],[20,4,20,5],[34,4,34,5],[25,2,25,3],[25,4,25,5],[27,2,27,3],[27,4,27,5],[28,2,28,3],[28,4,28,5],[29,2,29,3],[29,4,29,5],[31,2,31,3],[31,4,31,5],[32,4,32,5],[32,2,32,3],[15,2,15,3],[15,4,15,5],[16,2,16,3],[16,4,16,5],[24,4,24,5],[17,2,17,3],[17,4,17,5],[18,2,18,3],[18,4,18,5],[19,2,19,3],[19,4,19,5],[21,2,21,3],[21,4,21,5],[22,2,22,3],[22,4,22,5],[23,4,23,5],[12,2,12,3],[12,4,12,5],[13,2,13,3],[13,4,13,5],[14,2,14,3],[14,4,14,5],[33,10,33,13],[5,2,5,3],[5,4,5,5],[2,2,2,3],[2,5,2,8],[3,2,3,3],[3,5,3,8],[4,2,4,4],[6,2,6,3],[6,4,6,5],[7,2,7,3],[7,4,7,5],[8,2,8,3],[8,4,8,5],[9,2,9,3],[9,4,9,5],[42,4,42,5],[26,2,26,3],[30,2,30,3],[26,4,26,5],[30,4,30,5],[41,2,41,5],[42,2,42,3]]}
[]
[]
[null,null,"STATO AVANZAMENTO LAVORI N.2",null,null,{"$f":"'Dati Gen'!B28","v":0},null,null,null,null,null,null,null,{"$f":"'Dati Gen'!I3","v":"©2021 SIM srl - www.madosoft.it"}]
[null,null,"26/07/2021",null,null,{"$f":"'Dati Gen'!B29","v":0},null,null,null,null,null,null,null,{"$f":"'Dati Gen'!I2","v":"Pratica.110"}]
[]
[null,null,null,null,"Imponibile",null,"%iva","IVA","Importo"]
[null,null,{"$f":"'Computo-Massimali'!C7","v":"Importo complessivo Lavori"},null,{"$f":"'Computo-Massimali'!F7","v":483318},null,{"$f":"'Computo-Massimali'!G7","v":0.1},{"$f":"'Computo-Massimali'!H7","v":48331.8},{"$f":"'Computo-Massimali'!I7","v":531649.80000000005}]
[null,null,{"$f":"'Computo-Massimali'!C8","v":"di cui Oneri/Lavori x Sicurezza"},null,{"$f":"'Computo-Massimali'!F8","v":29675.725200000001},null,{"$f":"'Computo-Massimali'!G8","v":0.1},{"$f":"'Computo-Massimali'!H8","v":2967.5725200000002},{"$f":"'Computo-Massimali'!I8","v":32643.297720000002}]
[null,null,{"$f":"'Computo-Massimali'!C9","v":"Importo Lavori al netto della Sicurezza"},null,{"$f":"'Computo-Massimali'!F9","v":453642.27480000001},null,{"$f":"'Computo-Massimali'!G9","v":0.1},{"$f":"'Computo-Massimali'!H9","v":45364.227480000001},{"$f":"'Computo-Massimali'!I9","v":499006.50228000002}]
[null,null,{"$f":"'Computo-Massimali'!C10","v":"Spese tecniche (compresa iva)"},null,{"$f":"'Computo-Massimali'!F10","v":39824.899999999994},null,null,null,{"$f":"'Computo-Massimali'!I10","v":39824.899999999994}]
[null,null,null,null,null,null,null,null,{"$f":"'Computo-Massimali'!I11","v":571474.70000000007}]
[null,null,"Lavori Eseguiti"]
[null,null,"Oneri/Lavori x Sicurezza"]
[null,null,"Lavorazione",null,"Importo Lavori Eseguiti  ",null,"Incidenza Sicurezza","Imponibile","Iva","Importo c.iva","Spese tecniche","Totale","% SAL","Detrazione ",null,null,{"$f":"'Computo-Massimali'!S15","v":"Massimale  spesa"},null,"Ripartizione Spese Tecniche",null,"Fatturare"]
[null,null,{"$f":"'Computo-Massimali'!C16","v":"Isolamento pareti perimetrali"},null,null,null,{"$f":"IF('Computo-Massimali'!F16<>0,'Computo-Massimali'!G16*E15/'Computo-Massimali'!F16,0)","v":0},{"$f":"SUM(E15:G15)","v":0},{"$f":"H15*'Computo-Massimali'!$G$9","v":0},{"$f":"SUM(H15:I15)","v":0},{"$f":"IF('Computo-Massimali'!F16<>0,'Computo-Massimali'!K16*E15/'Computo-Massimali'!F16,0)","v":0},{"$f":"SUM(J15:K15)","v":0},{"$f":"IF(L15>0,L15/'Computo-Massimali'!L16,0)","v":0},{"$f":"IF(L15<=Q15,L15*1.1,Q15*1.1)","v":0},null,null,{"$f":"'Computo-Massimali'!S16","v":120000},null,{"$f":"IF('Computo-Massimali'!S3<>0,'Computo-Massimali'!S3,\"-\")","v":"Ape Ante"},{"$f":"$K$40*'Computo-Massimali'!AC3/'Computo-Massimali'!$AC$13","v":0},{"$f":"IF(T15>0,T15-'SAL.30%'!T15,\"0\")","v":"0"}]
[null,null,{"$f":"'Computo-Massimali'!C17","v":"Isolamento coperture"},null,0,null,{"$f":"IF('Computo-Massimali'!F17<>0,'Computo-Massimali'!G17*E16/'Computo-Massimali'!F17,0)","v":0},{"$f":"SUM(E16:G16)","v":0},{"$f":"H16*'Computo-Massimali'!$G$9","v":0},{"$f":"SUM(H16:I16)","v":0},{"$f":"IF('Computo-Massimali'!F17<>0,'Computo-Massimali'!K17*E16/'Computo-Massimali'!F17,0)","v":0},{"$f":"SUM(J16:K16)","v":0},{"$f":"IF(L16>0,L16/'Computo-Massimali'!L17,0)","v":0},0,null,null,{"$f":"'Computo-Massimali'!S17","v":120000},null,{"$f":"IF('Computo-Massimali'!S4<>0,'Computo-Massimali'!S4,\"-\")","v":"Progettazione e DL"},{"$f":"$K$40*'Computo-Massimali'!AC4/'Computo-Massimali'!$AC$13","v":0},{"$f":"IF(T16>0,T16-'SAL.30%'!T16,\"0\")","v":"0"}]
[null,null,{"$f":"'Computo-Massimali'!C18","v":"Isolamento Pavimenti"},null,0,null,{"$f":"IF('Computo-Massimali'!F18<>0,'Computo-Massimali'!G18*E17/'Computo-Massimali'!F18,0)","v":0},0,{"$f":"H17*'Computo-Massimali'!$G$9","v":0},0,{"$f":"IF('Computo-Massimali'!F18<>0,'Computo-Massimali'!K18*E17/'Computo-Massimali'!F18,0)","v":0},0,{"$f":"IF(L17>0,L17/'Computo-Massimali'!L18,0)","v":0},0,null,null,{"$f":"'Computo-Massimali'!S18","v":120000},null,{"$f":"IF('Computo-Massimali'!S5<>0,'Computo-Massimali'!S5,\"-\")","v":"Coord.SicurezzaEsec."},{"$f":"$K$40*'Computo-Massimali'!AC5/'Computo-Massimali'!$AC$13","v":0},{"$f":"IF(T17>0,T17-'SAL.30%'!T17,\"0\")","v":"0"}]
[null,null,{"$f":"'Computo-Massimali'!C19","v":"Isolamento sup. verticali e/o orizzontali"},null,{"$f":"SUM(E15:F17)","v":0},null,{"$f":"SUM(G15:G17)","v":0},{"$f":"SUM(H15:H17)","v":0},{"$f":"SUM(I15:I17)","v":0},{"$f":"SUM(J15:J17)","v":0},{"$f":"SUM(K15:K17)","v":0},{"$f":"IF('Dati Gen'!P17=\"Versione DEMO\",\"Versione DEMO\",SUM(J18:K18))","v":"Versione DEMO"},{"$f":"IF(L18>0,L18/'Computo-Massimali'!L19,0)","v":{"$error":"#VALUE!"}},{"$f":"IF(L18<=Q18,L18*1.1,Q18*1.1)","v":132000},null,null,{"$f":"'Computo-Massimali'!S19","v":120000},null,{"$f":"IF('Computo-Massimali'!S6<>0,'Computo-Massimali'!S6,\"-\")","v":"Ape Post"},{"$f":"$K$40*'Computo-Massimali'!AC6/'Computo-Massimali'!$AC$13","v":0},{"$f":"IF(T18>0,T18-'SAL.30%'!T18,\"0\")","v":"0"}]
[null,null,{"$f":"'Computo-Massimali'!C20","v":"Serramenti"},null,0,null,{"$f":"IF('Computo-Massimali'!F20<>0,'Computo-Massimali'!G20*E19/'Computo-Massimali'!F20,0)","v":0},0,{"$f":"H19*'Computo-Massimali'!$G$9","v":0},0,{"$f":"IF('Computo-Massimali'!F20<>0,'Computo-Massimali'!K20*E19/'Computo-Massimali'!F20,0)","v":0},0,{"$f":"IF(L19>0,L19/'Computo-Massimali'!L20,0)","v":0},0,null,null,{"$f":"'Computo-Massimali'!S20","v":163636.36363636362},null,{"$f":"IF('Computo-Massimali'!T7<>0,'Computo-Massimali'!T7,\"-\")","v":"-"},{"$f":"$K$40*'Computo-Massimali'!AC7/'Computo-Massimali'!$AC$13","v":0},{"$f":"IF(T19>0,T19-'SAL.30%'!T19,\"0\")","v":"0"}]
[null,null,{"$f":"'Computo-Massimali'!C21","v":"Serramenti con chiusure oscuranti"},null,null,null,{"$f":"IF('Computo-Massimali'!F21<>0,'Computo-Massimali'!G21*E20/'Computo-Massimali'!F21,0)","v":0},0,{"$f":"H20*'Computo-Massimali'!$G$9","v":0},0,{"$f":"IF('Computo-Massimali'!F21<>0,'Computo-Massimali'!K21*E20/'Computo-Massimali'!F21,0)","v":0},0,{"$f":"IF(L20>0,L20/'Computo-Massimali'!L21,0)","v":0},0,null,null,{"$f":"'Computo-Massimali'!S21","v":163636.36363636362},null,{"$f":"IF('Computo-Massimali'!T8<>0,'Computo-Massimali'!T8,\"-\")","v":"-"},{"$f":"$K$40*'Computo-Massimali'!AC8/'Computo-Massimali'!$AC$13","v":0},{"$f":"IF(T20>0,T20-'SAL.30%'!T20,\"0\")","v":"0"}]
[null,null,"Serramenti + chiusure oscuranti",null,{"$f":"SUM(E19:F20)","v":0},null,{"$f":"SUM(G19:G20)","v":0},0,0,0,0,0,{"$f":"IF(L21>0,L21/'Computo-Massimali'!L23,0)","v":0},0,null,null,{"$f":"'Computo-Massimali'!S23","v":163636.36363636362},null,{"$f":"IF('Computo-Massimali'!T9<>0,'Computo-Massimali'!T9,\"-\")","v":"-"},{"$f":"$K$40*'Computo-Massimali'!AC9/'Computo-Massimali'!$AC$13","v":0},{"$f":"IF(T21>0,T21-'SAL.30%'!T21,\"0\")","v":"0"}]
[null,null,{"$f":"'Computo-Massimali'!C23","v":"Schermature solari "},null,0,null,{"$f":"IF('Computo-Massimali'!F23<>0,'Computo-Massimali'!G23*E22/'Computo-Massimali'!F23,0)","v":0},0,{"$f":"H22*'Computo-Massimali'!$G$9","v":0},0,{"$f":"IF('Computo-Massimali'!F23<>0,'Computo-Massimali'!K23*E22/'Computo-Massimali'!F23,0)","v":0},0,{"$f":"IF(L22>0,L22/'Computo-Massimali'!L23,0)","v":0},0,null,null,{"$f":"'Computo-Massimali'!S23","v":163636.36363636362},null,{"$f":"IF('Computo-Massimali'!S12<>0,'Computo-Massimali'!S12,\"-\")","v":"Visto Conformità"},{"$f":"$K$40*'Computo-Massimali'!AC12/'Computo-Massimali'!$AC$13","v":0},{"$f":"IF(T22>0,T22-'SAL.30%'!T22,\"0\")","v":"0"}]
[null,null,{"$f":"'Computo-Massimali'!C24","v":"Solare Termico    - con collettori solari"},null,0,null,{"$f":"IF('Computo-Massimali'!F24<>0,'Computo-Massimali'!G24*E23/'Computo-Massimali'!F24,0)","v":0},0,{"$f":"H23*'Computo-Massimali'!$G$9","v":0},0,{"$f":"IF('Computo-Massimali'!F24<>0,'Computo-Massimali'!K24*E23/'Computo-Massimali'!F24,0)","v":0},0,{"$f":"IF(L23>0,L23/'Computo-Massimali'!L24,0)","v":0},0,null,null,{"$f":"'Computo-Massimali'!S24","v":60000},null,null,{"$f":"SUM(T15:T22)","v":0},{"$f":"SUM(U15:U22)","v":0}]
[null,null,{"$f":"MID('Computo-Massimali'!C25,1,28) &\"    kWp\"","v":"Solare Fotovoltaico             kWp"},{"$f":"'Computo-Massimali'!E25","v":6},0,null,{"$f":"IF('Computo-Massimali'!F25<>0,'Computo-Massimali'!G25*E24/'Computo-Massimali'!F25,0)","v":0},0,{"$f":"H24*'Computo-Massimali'!$G$9","v":0},0,{"$f":"IF('Computo-Massimali'!F25<>0,'Computo-Massimali'!K25*E24/'Computo-Massimali'!F25,0)","v":0},0,{"$f":"IF(L24>0,L24/'Computo-Massimali'!L25,0)","v":0},0,null,null,{"$f":"'Computo-Massimali'!S25","v":14400}]
[null,null,{"$f":"MID('Computo-Massimali'!C26,1,28) &\"    kWp\"","v":"Sistema di Accumulo             kWp"},{"$f":"'Computo-Massimali'!E26","v":10},0,null,{"$f":"IF('Computo-Massimali'!F26<>0,'Computo-Massimali'!G26*E25/'Computo-Massimali'!F26,0)","v":0},0,{"$f":"H25*'Computo-Massimali'!$G$9","v":0},0,{"$f":"IF('Computo-Massimali'!F26<>0,'Computo-Massimali'!K26*E25/'Computo-Massimali'!F26,0)","v":0},0,{"$f":"IF(L25>0,L25/'Computo-Massimali'!L26,0)","v":0},0,null,null,{"$f":"'Computo-Massimali'!S26","v":10000}]
[null,null,{"$f":"'Computo-Massimali'!C27","v":"Impianti climatizzazione e ACS"},null,null,null,{"$f":"IF('Computo-Massimali'!F27<>0,'Computo-Massimali'!G27*E26/'Computo-Massimali'!F27,0)","v":0},0,{"$f":"H26*'Computo-Massimali'!$G$9","v":0},0,{"$f":"IF('Computo-Massimali'!F27<>0,'Computo-Massimali'!K27*E26/'Computo-Massimali'!F27,0)","v":0},{"$f":"IF('Dati Gen'!P17=\"Versione DEMO\",\"Versione DEMO\",SUM(J26:K26))","v":"Versione DEMO"},{"$f":"IF(L26>0,L26/'Computo-Massimali'!L27,0)","v":{"$error":"#VALUE!"}},66000,null,null,{"$f":"'Computo-Massimali'!S27","v":60000}]
[null,null,{"$f":"'Computo-Massimali'!C28","v":"Sistemi di Microgenerazione"},null,0,null,{"$f":"IF('Computo-Massimali'!F28<>0,'Computo-Massimali'!G28*E27/'Computo-Massimali'!F28,0)","v":0},null,null,null,{"$f":"IF('Computo-Massimali'!F28<>0,'Computo-Massimali'!K28*E27/'Computo-Massimali'!F28,0)","v":0},null,null,null,null,null,{"$f":"'Computo-Massimali'!S28","v":272727.27272727271}]
[null,null,{"$f":"'Computo-Massimali'!C29","v":"Impianti Biomassa"},null,0,null,{"$f":"IF('Computo-Massimali'!F29<>0,'Computo-Massimali'!G29*E28/'Computo-Massimali'!F29,0)","v":0},0,{"$f":"H28*'Computo-Massimali'!$G$9","v":0},0,{"$f":"IF('Computo-Massimali'!F29<>0,'Computo-Massimali'!K29*E28/'Computo-Massimali'!F29,0)","v":0},0,{"$f":"IF(L28>0,L28/'Computo-Massimali'!L29,0)","v":0},0,null,null,{"$f":"'Computo-Massimali'!S29","v":81818.181818181809}]
[null,null,{"$f":"'Computo-Massimali'!C30","v":"Sistemi di Building Automation"},null,0,null,{"$f":"IF('Computo-Massimali'!F30<>0,'Computo-Massimali'!G30*E29/'Computo-Massimali'!F30,0)","v":0},0,{"$f":"H29*'Computo-Massimali'!$G$9","v":0},0,{"$f":"IF('Computo-Massimali'!F30<>0,'Computo-Massimali'!K30*E29/'Computo-Massimali'!F30,0)","v":0},0,{"$f":"IF(L29>0,L29/'Computo-Massimali'!L30,0)","v":0},0,null,null,{"$f":"'Computo-Massimali'!S30","v":40909.090909090912}]
[null,null,{"$f":"'Computo-Massimali'!C31","v":"Colonnine di Ricarica"},null,0,null,{"$f":"IF('Computo-Massimali'!F31<>0,'Computo-Massimali'!G31*E30/'Computo-Massimali'!F31,0)","v":0},0,{"$f":"H30*'Computo-Massimali'!$G$9","v":0},0,{"$f":"IF('Computo-Massimali'!F31<>0,'Computo-Massimali'!K31*E30/'Computo-Massimali'!F31,0)","v":0},0,{"$f":"IF(L30>0,L30/'Computo-Massimali'!L31,0)","v":0},0,null,null,{"$f":"'Computo-Massimali'!S31","v":4500}]
[null,null,{"$f":"'Computo-Massimali'!C32","v":"Eliminazione Barriere architettoniche"},null,0,null,{"$f":"IF('Computo-Massimali'!F32<>0,'Computo-Massimali'!G32*E31/'Computo-Massimali'!F32,0)","v":0},null,null,null,{"$f":"IF('Computo-Massimali'!F32<>0,'Computo-Massimali'!K32*E31/'Computo-Massimali'!F32,0)","v":0},null,null,null,null,null,{"$f":"'Computo-Massimali'!S32","v":0}]
[null,null,{"$f":"'Computo-Massimali'!C33","v":"SismaBonus"},null,0,null,{"$f":"IF('Computo-Massimali'!F33<>0,'Computo-Massimali'!G33*E32/'Computo-Massimali'!F33,0)","v":0},0,{"$f":"H32*'Computo-Massimali'!$G$9","v":0},0,{"$f":"IF('Computo-Massimali'!F33<>0,'Computo-Massimali'!K33*E32/'Computo-Massimali'!F33,0)","v":0},0,{"$f":"IF(L32>0,L32/'Computo-Massimali'!L33,0)","v":0},0,null,null,{"$f":"'Computo-Massimali'!S33","v":288000}]
[null,null,"Totali SAL N.2 Superbonus 110  ",null,{"$f":"E18+E21+SUM(E22:F32)","v":0},null,{"$f":"G18+G21+SUM(G22:G32)","v":0},{"$f":"H18+H21+SUM(H22:H32)","v":0},0,0,0,{"$f":"L18+L21+SUM(L22:L32)","v":{"$error":"#VALUE!"}},{"$f":"IF(L33>0,L33/'Computo-Massimali'!L34,0)","v":{"$error":"#VALUE!"}},{"$f":"N18+N21+SUM(N22:N32)","v":198000}]
[null,null,null,null,null,null,null,null,null,null,{"$f":"IF(M33>=59.999%,\"\",\"SAL Superbonus 110 inferiore 60%\")","v":{"$error":"#VALUE!"}}]
[null,null,{"$f":"'Computo-Massimali'!C36","v":"Lavori Ristrutturazione"},{"$f":"'Computo-Massimali'!E36","v":0},0,null,{"$f":"IF('Computo-Massimali'!F36<>0,'Computo-Massimali'!G36*E35/'Computo-Massimali'!F36,0)","v":0},{"$f":"SUM(E35:G35)","v":0},{"$f":"H35*'Computo-Massimali'!$G$9","v":0},{"$f":"SUM(H35:I35)","v":0},{"$f":"IF('Computo-Massimali'!F36<>0,'Computo-Massimali'!K36*E35/'Computo-Massimali'!F36,0)","v":0},{"$f":"SUM(J35:K35)","v":0},{"$f":"IF(L35>0,L35/'Computo-Massimali'!L36,0)","v":0},{"$f":"IF(L35<=Q35*D35,L35*D35,U35*D35)","v":0},null,null,{"$f":"'Computo-Massimali'!S36","v":288000}]
[null,null,{"$f":"'Computo-Massimali'!C37","v":0},{"$f":"'Computo-Massimali'!E37","v":0},0,null,{"$f":"IF('Computo-Massimali'!F37<>0,'Computo-Massimali'!G37*E36/'Computo-Massimali'!F37,0)","v":0},0,{"$f":"H36*'Computo-Massimali'!$G$9","v":0},0,{"$f":"IF('Computo-Massimali'!F37<>0,'Computo-Massimali'!K37*E36/'Computo-Massimali'!F37,0)","v":0},0,{"$f":"IF(L36>0,L36/'Computo-Massimali'!L37,0)","v":0},{"$f":"IF(L36<=Q36*D36,L36*D36,U36*D36)","v":0},null,null,{"$f":"'Computo-Massimali'!S37","v":288000}]
[null,null,"Totali SAL N.2 - Altri Interventi  ",null,{"$f":"SUM(E35:F36)","v":0},null,{"$f":"SUM(G35:G36)","v":0},{"$f":"SUM(H35:H36)","v":0},{"$f":"SUM(I35:I36)","v":0},{"$f":"SUM(J35:J36)","v":0},0,0,{"$f":"IF(L37>0,L37/'Computo-Massimali'!L38,0)","v":0},{"$f":"SUM(N35:N36)","v":0}]
[]
[null,null,null,null,{"$f":"E14","v":"Importo Lavori Eseguiti  "},null,"Incidenza Sicurezza","Imponibile",{"$f":"I14","v":"Iva"},"Importo c.iva","Spese tecniche","Totale","% SAL","Detrazione "]
[null,null,"Totali SAL N.2  ",null,{"$f":"E33+E37","v":0},null,{"$f":"G33+G37","v":0},{"$f":"H33+H37","v":0},{"$f":"I37+I33","v":0},{"$f":"J37+J33","v":0},{"$f":"K37+K33","v":0},{"$f":"SUM(J40:K40)","v":0},{"$f":"IF(L40>0,L40/'Computo-Massimali'!L40,0)","v":0},{"$f":"N37+N33","v":198000}]
[]
[null,null,{"$f":"IF(ABS(E13-G40)>0.01,\"Oneri/Lavori Sicurezza non imputabili al SAL, per lavori non eseguiti\",\"\")","v":""},null,null,null,{"$f":"IF(C42<>\"\",E13-G40,\"\")","v":""}]
[null,null,{"$f":"IF($C$42<>\"\",\"Importo Effettivo Lavori Eseguiti\",\"\")","v":""},null,{"$f":"IF($C$42<>\"\",E40,\"\")","v":""},null,{"$f":"IF($C$42<>\"\",E13,\"\")","v":""},{"$f":"IF($C$42<>\"\",E43+G43,\"\")","v":""},{"$f":"IF($C$42<>\"\",H43*G9,\"\")","v":""},{"$f":"IF($C$42<>\"\",H43+I43,\"\")","v":""},{"$f":"IF($C$42<>\"\",K40,\"\")","v":""},{"$f":"IF($C$42<>\"\",J43+K43,\"\")","v":""},{"$f":"IF($C$42<>\"\",L43/'Computo-Massimali'!L34,\"\")","v":""},{"$f":"IF($C$42<>\"\",L43*1.1,\"\")","v":""}]

{"sheet":"SAL.Finale","index":4,"n_rows":45,"n_cols":21,"rows_kept":45,"cut":false,"hidden":false,"merged":[[44,4,44,5],[41,15,41,18],[39,2,39,3],[40,2,40,3],[40,4,40,5],[39,4,39,5],[43,2,43,5],[44,2,44,3],[36,4,36,5],[38,2,38,3],[38,4,38,5],[41,2,41,3],[41,4,41,5],[36,2,36,3],[34,4,34,5],[35,4,35,5],[31,2,31,3],[31,4,31,5],[32,2,32,3],[26,2,26,3],[26,4,26,5],[32,4,32,5],[30,2,30,3],[30,4,30,5],[5,2,5,3],[5,4,5,5],[2,2,2,3],[2,5,2,8],[3,2,3,3],[3,5,3,8],[4,2,4,4],[33,10,33,13],[13,2,13,3],[13,4,13,5],[14,2,14,3],[14,4,14,5],[17,2,17,3],[17,4,17,5],[18,2,18,3],[18,4,18,5],[16,2,16,3],[16,4,16,5],[22,2,22,3],[22,4,22,5],[23,4,23,5],[24,4,24,5],[19,2,19,3],[6,9,6,12],[7,2,7,3],[7,4,7,5],[7,9,7,12],[15,2,15,3],[15,4,15,5],[12,2,12,3],[12,4,12,5],[8,9,8,12],[9,2,9,3],[9,4,9,5],[9,9,9,12],[8,2,8,3],[8,4,8,5],[45,4,45,5],[6,2,6,3],[6,4,6,5],[19,4,19,5],[21,2,21,3],[21,4,21,5],[20,2,20,3],[20,4,20,5],[29,2,29,3],[29,4,29,5],[25,2,25,3],[25,4,25,5],[27,2,27,3],[27,4,27,5],[28,2,28,3],[28,4,28,5]]}
[]
[]
[null,null,"STATO AVANZAMENTO LAVORI Finale",null,null,{"$f":"'Dati Gen'!B28","v":0},null,null,null,null,null,null,null,{"$f":"'Dati Gen'!I3","v":"©2021 SIM srl - www.madosoft.it"}]
[null,null,"29/07/2021",null,null,{"$f":"'Dati Gen'!B29","v":0},null,null,null,null,null,null,null,{"$f":"'Dati Gen'!I2","v":"Pratica.110"}]
[]
[null,null,null,null,"Imponibile",null,"%iva","IVA","Importo"]
[null,null,{"$f":"'Computo-Massimali'!C7","v":"Importo complessivo Lavori"},null,{"$f":"'Computo-Massimali'!F7","v":483318},null,{"$f":"'Computo-Massimali'!G7","v":0.1},{"$f":"'Computo-Massimali'!H7","v":48331.8},{"$f":"'Computo-Massimali'!I7","v":531649.80000000005}]
[null,null,{"$f":"'Computo-Massimali'!C8","v":"di cui Oneri/Lavori x Sicurezza"},null,{"$f":"'Computo-Massimali'!F8","v":29675.725200000001},null,{"$f":"'Computo-Massimali'!G8","v":0.1},{"$f":"'Computo-Massimali'!H8","v":2967.5725200000002},{"$f":"'Computo-Massimali'!I8","v":32643.297720000002}]
[null,null,{"$f":"'Computo-Massimali'!C9","v":"Importo Lavori al netto della Sicurezza"},null,{"$f":"'Computo-Massimali'!F9","v":453642.27480000001},null,{"$f":"'Computo-Massimali'!G9","v":0.1},{"$f":"'Computo-Massimali'!H9","v":45364.227480000001},{"$f":"'Computo-Massimali'!I9","v":499006.50228000002}]
[null,null,{"$f":"'Computo-Massimali'!C10","v":"Spese tecniche (compresa iva)"},null,{"$f":"'Computo-Massimali'!F10","v":39824.899999999994},null,{"$f":"'Computo-Massimali'!G10","v":0},{"$f":"'Computo-Massimali'!H10","v":0},{"$f":"'Computo-Massimali'!I10","v":39824.899999999994}]
[null,null,null,null,null,null,null,null,{"$f":"'Computo-Massimali'!I11","v":571474.70000000007}]
[null,null,"Lavori Eseguiti"]
[null,null,"Oneri/Lavori x Sicurezza",null,{"$f":"'Computo-Massimali'!F8","v":29675.725200000001}]
[null,null,"Lavorazione",null,"Importo Lavori Eseguiti  ",null,"Incidenza Sicurezza","Imponibile","Iva","Importo c.iva","Spese tecniche","Totale","% SAL","Detrazione ",null,null,{"$f":"'Computo-Massimali'!S15","v":"Massimale  spesa"},null,"Ripartizione Spese Tecniche",null,"Fatturare"]
[null,null,{"$f":"'Computo-Massimali'!C16","v":"Isolamento pareti perimetrali"},null,{"$f":"'Computo-Massimali'!F16","v":0},null,{"$f":"IF('Computo-Massimali'!F16<>0,'Computo-Massimali'!G16*E15/'Computo-Massimali'!F16,0)","v":0},{"$f":"SUM(E15:G15)","v":0},{"$f":"H15*'Computo-Massimali'!$G$9","v":0},{"$f":"SUM(H15:I15)","v":0},{"$f":"IF('Computo-Massimali'!F16<>0,'Computo-Massimali'!K16*E15/'Computo-Massimali'!F16,0)","v":0},{"$f":"SUM(J15:K15)","v":0},{"$f":"IF(L15>0,L15/'Computo-Massimali'!L16,0)","v":0},{"$f":"IF(L15<=Q15,L15*1.1,Q15*1.1)","v":0},null,null,{"$f":"'Computo-Massimali'!S16","v":120000},null,{"$f":"IF('Computo-Massimali'!S3<>0,'Computo-Massimali'!S3,\"-\")","v":"Ape Ante"},{"$f":"$K$42*'Computo-Massimali'!AC3/'Computo-Massimali'!$AC$13","v":210.26528292515397},{"$f":"IF(T15>0,T15-'SAL.30%'!T15-'SAL.60%'!U15,\"\")","v":210.26528292515397}]
[null,null,{"$f":"'Computo-Massimali'!C17","v":"Isolamento coperture"},null,{"$f":"'Computo-Massimali'!F17","v":0},null,{"$f":"IF('Computo-Massimali'!F17<>0,'Computo-Massimali'!G17*E16/'Computo-Massimali'!F17,0)","v":0},{"$f":"SUM(E16:G16)","v":0},{"$f":"H16*'Computo-Massimali'!$G$9","v":0},{"$f":"SUM(H16:I16)","v":0},{"$f":"IF('Computo-Massimali'!F17<>0,'Computo-Massimali'!K17*E16/'Computo-Massimali'!F17,0)","v":0},{"$f":"SUM(J16:K16)","v":0},{"$f":"IF(L16>0,L16/'Computo-Massimali'!L17,0)","v":0},0,null,null,{"$f":"'Computo-Massimali'!S17","v":120000},null,{"$f":"IF('Computo-Massimali'!S4<>0,'Computo-Massimali'!S4,\"-\")","v":"Progettazione e DL"},{"$f":"$K$42*'Computo-Massimali'!AC4/'Computo-Massimali'!$AC$13","v":5440.7675626167411},{"$f":"IF(T16>0,T16-'SAL.30%'!T16-'SAL.60%'!U16,\"\")","v":5440.7675626167411}]
[null,null,{"$f":"'Computo-Massimali'!C18","v":"Isolamento Pavimenti"},null,{"$f":"'Computo-Massimali'!F18","v":0},null,{"$f":"IF('Computo-Massimali'!F18<>0,'Computo-Massimali'!G18*E17/'Computo-Massimali'!F18,0)","v":0},0,{"$f":"H17*'Computo-Massimali'!$G$9","v":0},0,{"$f":"IF('Computo-Massimali'!F18<>0,'Computo-Massimali'!K18*E17/'Computo-Massimali'!F18,0)","v":0},0,{"$f":"IF(L17>0,L17/'Computo-Massimali'!L18,0)","v":0},0,null,null,{"$f":"'Computo-Massimali'!S18","v":120000},null,{"$f":"IF('Computo-Massimali'!S5<>0,'Computo-Massimali'!S5,\"-\")","v":"Coord.SicurezzaEsec."},{"$f":"$K$42*'Computo-Massimali'!AC5/'Computo-Massimali'!$AC$13","v":1050.0746508258219},{"$f":"IF(T17>0,T17-'SAL.30%'!T17-'SAL.60%'!U17,\"\")","v":1050.0746508258219}]
[null,null,{"$f":"'Computo-Massimali'!C19","v":"Isolamento sup. verticali e/o orizzontali"},null,{"$f":"SUM(E15:F17)","v":0},null,{"$f":"SUM(G15:G17)","v":0},{"$f":"SUM(H15:H17)","v":0},{"$f":"SUM(I15:I17)","v":0},{"$f":"SUM(J15:J17)","v":0},{"$f":"SUM(K15:K17)","v":0},{"$f":"IF('Dati Gen'!P17=\"Versione DEMO\",\"Versione DEMO\",SUM(J18:K18))","v":"Versione DEMO"},{"$f":"IF(L18>0,L18/'Computo-Massimali'!L19,0)","v":{"$error":"#VALUE!"}},132000,null,null,{"$f":"'Computo-Massimali'!S19","v":120000},null,{"$f":"IF('Computo-Massimali'!S6<>0,'Computo-Massimali'!S6,\"-\")","v":"Ape Post"},{"$f":"$K$42*'Computo-Massimali'!AC6/'Computo-Massimali'!$AC$13","v":269.98786488465777},{"$f":"IF(T18>0,T18-'SAL.30%'!T18-'SAL.60%'!U18,\"\")","v":269.98786488465777}]
[null,null,{"$f":"'Computo-Massimali'!C20","v":"Serramenti"},null,{"$f":"'Computo-Massimali'!F20","v":0},null,{"$f":"IF('Computo-Massimali'!F20<>0,'Computo-Massimali'!G20*E19/'Computo-Massimali'!F20,0)","v":0},0,{"$f":"H19*'Computo-Massimali'!$G$9","v":0},0,{"$f":"IF('Computo-Massimali'!F20<>0,'Computo-Massimali'!K20*E19/'Computo-Massimali'!F20,0)","v":0},0,{"$f":"IF(L19>0,L19/'Computo-Massimali'!L20,0)","v":0},0,null,null,{"$f":"'Computo-Massimali'!S20","v":163636.36363636362},null,{"$f":"IF('Computo-Massimali'!T7<>0,'Computo-Massimali'!T7,\"-\")","v":"-"},{"$f":"$K$42*'Computo-Massimali'!AC7/'Computo-Massimali'!$AC$13","v":0},{"$f":"IF(T19>0,T19-'SAL.30%'!T19-'SAL.60%'!U19,\"\")","v":""}]
[null,null,{"$f":"'Computo-Massimali'!C21","v":"Serramenti con chiusure oscuranti"},null,{"$f":"'Computo-Massimali'!F21","v":0},null,{"$f":"IF('Computo-Massimali'!F21<>0,'Computo-Massimali'!G21*E20/'Computo-Massimali'!F21,0)","v":0},0,{"$f":"H20*'Computo-Massimali'!$G$9","v":0},0,{"$f":"IF('Computo-Massimali'!F21<>0,'Computo-Massimali'!K21*E20/'Computo-Massimali'!F21,0)","v":0},0,{"$f":"IF(L20>0,L20/'Computo-Massimali'!L21,0)","v":0},0,null,null,{"$f":"'Computo-Massimali'!S21","v":163636.36363636362},null,{"$f":"IF('Computo-Massimali'!T8<>0,'Computo-Massimali'!T8,\"-\")","v":"-"},{"$f":"$K$42*'Computo-Massimali'!AC8/'Computo-Massimali'!$AC$13","v":0},{"$f":"IF(T20>0,T20-'SAL.30%'!T20-'SAL.60%'!U20,\"\")","v":""}]
[null,null,"Serramenti + chiusure oscuranti",null,{"$f":"SUM(E19:F20)","v":0},null,{"$f":"SUM(G19:G20)","v":0},0,0,0,0,0,{"$f":"IF(L21>0,L21/'Computo-Massimali'!L23,0)","v":0},0,null,null,{"$f":"'Computo-Massimali'!S23","v":163636.36363636362},null,{"$f":"IF('Computo-Massimali'!T9<>0,'Computo-Massimali'!T9,\"-\")","v":"-"},{"$f":"$K$42*'Computo-Massimali'!AC9/'Computo-Massimali'!$AC$13","v":0},{"$f":"IF(T21>0,T21-'SAL.30%'!T21-'SAL.60%'!U21,\"\")","v":""}]
[null,null,{"$f":"'Computo-Massimali'!C23","v":"Schermature solari "},null,{"$f":"'Computo-Massimali'!F23","v":0},null,{"$f":"IF('Computo-Massimali'!F23<>0,'Computo-Massimali'!G23*E22/'Computo-Massimali'!F23,0)","v":0},0,{"$f":"H22*'Computo-Massimali'!$G$9","v":0},0,{"$f":"IF('Computo-Massimali'!F23<>0,'Computo-Massimali'!K23*E22/'Computo-Massimali'!F23,0)","v":0},0,{"$f":"IF(L22>0,L22/'Computo-Massimali'!L23,0)","v":0},0,null,null,{"$f":"'Computo-Massimali'!S23","v":163636.36363636362},null,{"$f":"IF('Computo-Massimali'!S12<>0,'Computo-Massimali'!S12,\"-\")","v":"Visto Conformità"},{"$f":"$K$42*'Computo-Massimali'!AC12/'Computo-Massimali'!$AC$13","v":1268.8002018137649},{"$f":"IF(T22>0,T22-'SAL.30%'!T22-'SAL.60%'!U22,\"\")","v":1268.8002018137649}]
[null,null,{"$f":"'Computo-Massimali'!C24","v":"Solare Termico    - con collettori solari"},null,{"$f":"'Computo-Massimali'!F24","v":0},null,{"$f":"IF('Computo-Massimali'!F24<>0,'Computo-Massimali'!G24*E23/'Computo-Massimali'!F24,0)","v":0},0,{"$f":"H23*'Computo-Massimali'!$G$9","v":0},0,{"$f":"IF('Computo-Massimali'!F24<>0,'Computo-Massimali'!K24*E23/'Computo-Massimali'!F24,0)","v":0},0,{"$f":"IF(L23>0,L23/'Computo-Massimali'!L24,0)","v":0},0,null,null,{"$f":"'Computo-Massimali'!S24","v":60000},null,null,{"$f":"SUM(T15:T22)","v":8239.8955630661403},{"$f":"SUM(U15:U22)","v":8239.8955630661403}]
[null,null,{"$f":"MID('Computo-Massimali'!C25,1,28) &\"    kWp\"","v":"Solare Fotovoltaico             kWp"},{"$f":"'Computo-Massimali'!E25","v":6},{"$f":"'Computo-Massimali'!F25","v":0},null,{"$f":"IF('Computo-Massimali'!F25<>0,'Computo-Massimali'!G25*E24/'Computo-Massimali'!F25,0)","v":0},0,{"$f":"H24*'Computo-Massimali'!$G$9","v":0},0,{"$f":"IF('Computo-Massimali'!F25<>0,'Computo-Massimali'!K25*E24/'Computo-Massimali'!F25,0)","v":0},0,{"$f":"IF(L24>0,L24/'Computo-Massimali'!L25,0)","v":0},0,null,null,{"$f":"'Computo-Massimali'!S25","v":14400}]
[null,null,{"$f":"MID('Computo-Massimali'!C26,1,28) &\"    kWp\"","v":"Sistema di Accumulo             kWp"},{"$f":"'Computo-Massimali'!E26","v":10},{"$f":"'Computo-Massimali'!F26","v":0},null,{"$f":"IF('Computo-Massimali'!F26<>0,'Computo-Massimali'!G26*E25/'Computo-Massimali'!F26,0)","v":0},0,{"$f":"H25*'Computo-Massimali'!$G$9","v":0},0,{"$f":"IF('Computo-Massimali'!F26<>0,'Computo-Massimali'!K26*E25/'Computo-Massimali'!F26,0)","v":0},0,{"$f":"IF(L25>0,L25/'Computo-Massimali'!L26,0)","v":0},0,null,null,{"$f":"'Computo-Massimali'!S26","v":10000}]
[null,null,{"$f":"'Computo-Massimali'!C27","v":"Impianti climatizzazione e ACS"},null,{"$f":"'Computo-Massimali'!F27","v":0},null,{"$f":"IF('Computo-Massimali'!F27<>0,'Computo-Massimali'!G27*E26/'Computo-Massimali'!F27,0)","v":0},0,{"$f":"H26*'Computo-Massimali'!$G$9","v":0},0,{"$f":"IF('Computo-Massimali'!F27<>0,'Computo-Massimali'!K27*E26/'Computo-Massimali'!F27,0)","v":0},{"$f":"IF('Dati Gen'!P17=\"Versione DEMO\",\"Versione DEMO\",SUM(J26:K26))","v":"Versione DEMO"},{"$f":"IF(L26>0,L26/'Computo-Massimali'!L27,0)","v":{"$error":"#VALUE!"}},66000,null,null,{"$f":"'Computo-Massimali'!S27","v":60000}]
[null,null,{"$f":"'Computo-Massimali'!C28","v":"Sistemi di Microgenerazione"},null,{"$f":"'Computo-Massimali'!F28","v":0},null,{"$f":"IF('Computo-Massimali'!F28<>0,'Computo-Massimali'!G28*E27/'Computo-Massimali'!F28,0)","v":0},{"$f":"SUM(E27:G27)","v":0},{"$f":"H27*'Computo-Massimali'!$G$9","v":0},{"$f":"SUM(H27:I27)","v":0},{"$f":"IF('Computo-Massimali'!F28<>0,'Computo-Massimali'!K28*E27/'Computo-Massimali'!F28,0)","v":0},{"$f":"IF('Dati Gen'!P18=\"Versione DEMO\",\"Versione DEMO\",SUM(J27:K27))","v":0},{"$f":"IF(L27>0,L27/'Computo-Massimali'!L28,0)","v":0},0,null,null,{"$f":"'Computo-Massimali'!S28","v":272727.27272727271}]
[null,null,{"$f":"'Computo-Massimali'!C29","v":"Impianti Biomassa"},null,{"$f":"'Computo-Massimali'!F29","v":0},null,{"$f":"IF('Computo-Massimali'!F29<>0,'Computo-Massimali'!G29*E28/'Computo-Massimali'!F29,0)","v":0},0,{"$f":"H28*'Computo-Massimali'!$G$9","v":0},0,{"$f":"IF('Computo-Massimali'!F29<>0,'Computo-Massimali'!K29*E28/'Computo-Massimali'!F29,0)","v":0},0,{"$f":"IF(L28>0,L28/'Computo-Massimali'!L29,0)","v":0},0,null,null,{"$f":"'Computo-Massimali'!S29","v":81818.181818181809}]
[null,null,{"$f":"'Computo-Massimali'!C30","v":"Sistemi di Building Automation"},null,{"$f":"'Computo-Massimali'!F30","v":0},null,{"$f":"IF('Computo-Massimali'!F30<>0,'Computo-Massimali'!G30*E29/'Computo-Massimali'!F30,0)","v":0},0,{"$f":"H29*'Computo-Massimali'!$G$9","v":0},0,{"$f":"IF('Computo-Massimali'!F30<>0,'Computo-Massimali'!K30*E29/'Computo-Massimali'!F30,0)","v":0},0,{"$f":"IF(L29>0,L29/'Computo-Massimali'!L30,0)","v":0},0,null,null,{"$f":"'Computo-Massimali'!S30","v":40909.090909090912}]
[null,null,{"$f":"'Computo-Massimali'!C31","v":"Colonnine di Ricarica"},null,{"$f":"'Computo-Massimali'!F31","v":0},null,{"$f":"IF('Computo-Massimali'!F31<>0,'Computo-Massimali'!G31*E30/'Computo-Massimali'!F31,0)","v":0},0,{"$f":"H30*'Computo-Massimali'!$G$9","v":0},0,{"$f":"IF('Computo-Massimali'!F31<>0,'Computo-Massimali'!K31*E30/'Computo-Massimali'!F31,0)","v":0},0,{"$f":"IF(L30>0,L30/'Computo-Massimali'!L31,0)","v":0},0,null,null,{"$f":"'Computo-Massimali'!S31","v":4500}]
[null,null,{"$f":"'Computo-Massimali'!C32","v":"Eliminazione Barriere architettoniche"},null,{"$f":"'Computo-Massimali'!F32","v":93860},null,{"$f":"IF('Computo-Massimali'!F32<>0,'Computo-Massimali'!G32*E31/'Computo-Massimali'!F32,0)","v":6139.9999999999991},{"$f":"SUM(E31:G31)","v":100000},{"$f":"H31*'Computo-Massimali'!$G$9","v":10000},{"$f":"SUM(H31:I31)","v":110000},{"$f":"IF('Computo-Massimali'!F32<>0,'Computo-Massimali'!K32*E31/'Computo-Massimali'!F32,0)","v":8239.8955630661385},{"$f":"SUM(J31:K31)","v":118239.89556306614},{"$f":"IF(L31>0,L31/'Computo-Massimali'!L32,0)","v":1},{"$f":"IF(L31<=Q31,L31*1.1,Q31*1.1)","v":0},null,null,{"$f":"'Computo-Massimali'!S32","v":0}]
[null,null,{"$f":"'Computo-Massimali'!C33","v":"SismaBonus"},null,0,null,{"$f":"IF('Computo-Massimali'!F33<>0,'Computo-Massimali'!G33*E32/'Computo-Massimali'!F33,0)","v":0},0,{"$f":"H32*'Computo-Massimali'!$G$9","v":0},0,{"$f":"IF('Computo-Massimali'!F33<>0,'Computo-Massimali'!K33*E32/'Computo-Massimali'!F33,0)","v":0},0,{"$f":"IF(L32>0,L32/'Computo-Massimali'!L33,0)","v":0},0,null,null,{"$f":"'Computo-Massimali'!S33","v":288000}]
[null,null,"Totali SAL FINALE Superbonus 110  ",null,{"$f":"E18+E21+SUM(E22:F32)","v":93860},null,{"$f":"G18+G21+SUM(G22:G32)","v":6139.9999999999991},{"$f":"H18+H21+SUM(H22:H32)","v":100000},10000,110000,8239.8955630661385,{"$error":"#VALUE!"},{"$f":"IF(L33>0,L33/'Computo-Massimali'!L34,0)","v":{"$error":"#VALUE!"}},{"$f":"N18+N21+SUM(N22:N32)","v":198000}]
[null,null,null,null,null,null,null,null,null,null,{"$f":"IF(M33>=99.999%,\"\",\"SAL Superbonus 110 inferiore 100%\")","v":{"$error":"#VALUE!"}}]
[null,null,{"$f":"'Computo-Massimali'!C36","v":"Lavori Ristrutturazione"},{"$f":"'Computo-Massimali'!E36","v":0},{"$f":"'Computo-Massimali'!F36","v":0},null,{"$f":"IF('Computo-Massimali'!F36<>0,'Computo-Massimali'!G36*E35/'Computo-Massimali'!F36,0)","v":0},{"$f":"SUM(E35:G35)","v":0},{"$f":"H35*'Computo-Massimali'!$G$9","v":0},{"$f":"SUM(H35:I35)","v":0},{"$f":"IF('Computo-Massimali'!F36<>0,'Computo-Massimali'!K36*E35/'Computo-Massimali'!F36,0)","v":0},{"$f":"SUM(J35:K35)","v":0},{"$f":"IF(L35>0,L35/'Computo-Massimali'!L36,0)","v":0},{"$f":"IF(L35<=Q35*D35,L35*D35,U35*D35)","v":0},null,null,{"$f":"'Computo-Massimali'!S36","v":288000}]
[null,null,{"$f":"'Computo-Massimali'!C37","v":0},{"$f":"'Computo-Massimali'!E37","v":0},{"$f":"'Computo-Massimali'!F37","v":0},null,{"$f":"IF('Computo-Massimali'!F37<>0,'Computo-Massimali'!G37*E36/'Computo-Massimali'!F37,0)","v":0},0,{"$f":"H36*'Computo-Massimali'!$G$9","v":0},0,{"$f":"IF('Computo-Massimali'!F37<>0,'Computo-Massimali'!K37*E36/'Computo-Massimali'!F37,0)","v":0},0,{"$f":"IF(L36>0,L36/'Computo-Massimali'!L37,0)","v":0},{"$f":"IF(L36<=Q36*D36,L36*D36,U36*D36)","v":0},null,null,{"$f":"'Computo-Massimali'!S37","v":288000}]
[null,null,"Totali SAL FINALE - Altri Interventi  ",null,{"$f":"SUM(E35:F36)","v":0},null,{"$f":"SUM(G35:G36)","v":0},{"$f":"SUM(H35:H36)","v":0},{"$f":"SUM(I35:I36)","v":0},{"$f":"SUM(J35:J36)","v":0},0,0,{"$f":"IF(L37>0,L37/'Computo-Massimali'!L38,0)","v":0},{"$f":"SUM(N35:N36)","v":0}]
[]
[null,null,null,null,{"$f":"E14","v":"Importo Lavori Eseguiti  "},null,"Incidenza Sicurezza","Imponibile",{"$f":"I14","v":"Iva"},"Importo c.iva","Spese tecniche","Totale","% SAL","Detrazione "]
[null,null,{"$f":"'SAL.30%'!C40","v":"Totali SAL N.1"},null,{"$f":"'SAL.30%'!E40","v":46563.75},null,{"$f":"'SAL.30%'!G40","v":0},{"$f":"'SAL.30%'!H40","v":46563.75},{"$f":"'SAL.30%'!I40","v":4656.3750000000009},{"$f":"'SAL.30%'!J40","v":51220.125000000007},{"$f":"'SAL.30%'!K40","v":0},{"$f":"'SAL.30%'!L40","v":51220.125000000007},{"$f":"'SAL.30%'!M40","v":8.9627984724261187E-2},{"$f":"'SAL.30%'!N40","v":210489.3285}]
[null,null,{"$f":"'SAL.60%'!C40","v":"Totali SAL N.2  "},null,{"$f":"'SAL.60%'!E40","v":0},null,{"$f":"'SAL.60%'!G40","v":0},{"$f":"'SAL.60%'!H40","v":0},{"$f":"'SAL.60%'!I40","v":0},{"$f":"'SAL.60%'!J40","v":0},{"$f":"'SAL.60%'!K40","v":0},{"$f":"'SAL.60%'!L40","v":0},{"$f":"'SAL.60%'!M40","v":0},{"$f":"'SAL.60%'!N40","v":198000}]
[null,null,"Totali SAL Finale",null,{"$f":"E33+E37","v":93860},null,{"$f":"G33+G37","v":6139.9999999999991},{"$f":"H33+H37","v":100000},{"$f":"I37+I33","v":10000},{"$f":"J37+J33","v":110000},{"$f":"K37+K33","v":8239.8955630661385},{"$f":"L37+L33","v":{"$error":"#VALUE!"}},{"$f":"IF(E9<>0,E42/E9,0)","v":0.20690311554711391},{"$f":"N37+N33","v":198000}]
[]
[null,null,{"$f":"IF(ABS(E13-G42)>0.01,\"Oneri/Lavori Sicurezza non imputabili al SAL, per lavori non eseguiti\",\"\")","v":"Oneri/Lavori Sicurezza non imputabili al SAL, per lavori non eseguiti"},null,null,null,{"$f":"IF(C44<>\"\",E13-G42,\"\")","v":23535.725200000001},null,null,null,null,null,"Quota a carico cliente :"]
[null,null,{"$f":"IF($C$44<>\"\",\"Importo Effettivo Lavori Eseguiti\",\"\")","v":"Importo Effettivo Lavori Eseguiti"},null,{"$f":"IF($C$44<>\"\",E42,\"\")","v":93860},null,{"$f":"IF($C$44<>\"\",E13,\"\")","v":29675.725200000001},{"$f":"IF($C$44<>\"\",E45+G45,\"\")","v":123535.7252},{"$f":"IF($C$44<>\"\",H45*G9,\"\")","v":12353.572520000002},{"$f":"IF($C$44<>\"\",H45+I45,\"\")","v":135889.29772},{"$f":"IF($C$44<>\"\",K42,\"\")","v":8239.8955630661385},{"$f":"IF($C$44<>\"\",J45+K45,\"\")","v":144129.19328306615},{"$f":"IF($C$44<>\"\",L45/'Computo-Massimali'!L40,\"\")","v":0.2522057322955526},{"$f":"IF($C$44<>\"\",L45*1.1,\"\")","v":158542.11261137278}]

{"sheet":"Pratica ENEA","index":5,"n_rows":208,"n_cols":27,"rows_kept":208,"cut":false,"hidden":false,"merged":[[105,7,105,8],[105,9,105,10],[106,1,106,4],[106,5,106,6],[101,9,101,10],[102,1,102,8],[102,9,102,10],[99,1,99,5],[99,7,99,8],[106,7,106,8],[106,9,106,10],[50,1,50,18],[123,1,123,5],[124,1,124,5],[51,7,52,7],[66,9,66,10],[65,1,65,4],[65,5,65,6],[65,7,65,8],[90,9,90,10],[91,1,91,8],[91,9,91,10],[86,9,86,10],[87,1,87,8],[82,12,82,13],[76,7,76,8],[77,7,77,8],[78,7,78,8],[79,7,79,8],[80,7,80,8],[115,1,115,5],[116,1,116,5],[117,1,117,5],[119,1,119,5],[97,7,97,8],[51,8,51,11],[51,12,51,18],[51,1,56,4],[51,5,52,5],[99,16,99,17],[107,1,107,8],[125,1,125,5],[127,1,127,5],[128,1,128,5],[113,1,113,5],[110,1,110,18],[111,1,111,5],[67,7,67,8],[64,9,64,10],[65,9,65,10],[66,1,66,4],[66,5,66,6],[66,7,66,8],[112,1,112,5],[104,1,104,4],[104,5,104,6],[96,7,96,8],[97,1,97,5],[99,13,99,14],[30,9,30,10],[93,1,93,18],[88,1,88,4],[88,5,88,6],[88,7,88,8],[88,9,88,10],[89,1,89,4],[89,5,89,6],[89,7,89,8],[89,9,89,10],[90,1,90,4],[90,5,90,6],[90,7,90,8],[63,1,63,8],[63,9,63,10],[64,1,64,8],[76,1,76,5],[77,1,77,5],[78,1,78,5],[81,1,81,5],[80,1,80,5],[79,1,79,5],[67,1,67,4],[67,5,67,6],[23,22,23,23],[95,16,95,17],[96,16,96,17],[97,16,97,17],[98,16,98,17],[95,13,95,14],[96,13,96,14],[97,13,97,14],[98,13,98,14],[29,22,29,23],[75,1,75,15],[67,9,67,10],[68,9,68,10],[41,1,41,5],[42,1,42,5],[43,1,43,5],[37,1,37,8],[40,1,40,18],[45,1,45,5],[48,1,48,5],[62,1,62,8],[62,9,62,10],[51,6,52,6],[37,9,37,10],[1,12,1,18],[73,1,73,18],[30,22,30,23],[94,16,94,17],[76,12,76,13],[77,12,77,13],[78,12,78,13],[79,12,79,13],[80,12,80,13],[81,12,81,13],[94,13,94,14],[82,7,82,8],[83,7,83,8],[26,1,26,5],[58,1,58,5],[59,1,59,5],[60,1,60,5],[44,1,44,5],[49,1,49,5],[2,6,2,11],[13,1,13,18],[46,1,46,5],[47,1,47,5],[68,1,68,8],[31,1,31,8],[32,1,32,8],[32,9,32,10],[33,1,33,8],[35,9,35,10],[36,9,36,10],[34,5,34,6],[35,5,35,6],[36,5,36,6],[34,1,34,4],[35,1,35,4],[36,1,36,4],[34,7,34,8],[35,7,35,8],[36,7,36,8],[31,9,31,10],[34,9,34,10],[1,2,1,11],[3,2,3,11],[2,2,2,5],[18,1,18,5],[7,2,7,7],[10,2,10,7],[33,9,33,10],[28,1,28,5],[30,1,30,8],[19,1,19,5],[20,1,20,5],[21,1,21,5],[22,1,22,5],[8,2,8,5],[8,6,8,10],[9,6,9,11],[11,9,11,10],[4,6,4,11],[5,6,5,11],[6,6,6,11],[27,1,27,5],[23,1,23,5],[11,1,11,6],[11,7,11,8],[16,12,16,14],[16,1,17,5],[16,6,17,6],[16,7,17,7],[16,8,17,8],[16,9,17,9],[16,10,17,10],[16,11,17,11],[15,1,15,14],[138,1,138,5],[81,7,81,8],[82,1,82,5],[85,1,85,8],[85,9,85,10],[86,1,86,8],[87,9,87,10],[83,1,83,5],[83,12,83,13],[94,1,94,5],[94,7,94,8],[134,9,134,10],[129,1,129,5],[132,1,132,8],[132,9,132,10],[133,1,133,8],[133,9,133,10],[103,1,103,8],[103,9,103,10],[101,1,101,8],[104,7,104,8],[104,9,104,10],[105,1,105,4],[105,5,105,6],[166,1,166,4],[166,5,166,6],[95,1,95,5],[95,7,95,8],[130,1,130,10],[135,1,135,10],[146,1,146,10],[141,1,141,10],[143,1,143,8],[144,1,144,8],[145,1,145,8],[131,1,131,8],[131,9,131,10],[134,1,134,8],[142,9,142,10],[143,9,143,10],[144,9,144,10],[145,9,145,10],[120,1,120,5],[121,1,121,5],[107,9,107,10],[98,1,98,5],[98,7,98,8],[96,1,96,5],[156,1,156,10],[158,1,158,5],[158,9,158,10],[154,9,154,10],[155,1,155,8],[155,9,155,10],[148,9,148,10],[149,9,149,10],[150,9,150,10],[148,1,148,5],[149,1,149,5],[150,1,150,5],[152,1,152,8],[152,9,152,10],[153,1,153,8],[153,9,153,10],[154,1,154,8],[151,1,151,10],[166,7,166,8],[166,9,166,10],[167,1,167,4],[167,5,167,6],[167,7,167,8],[139,1,139,5],[140,1,140,5],[142,1,142,8],[160,1,160,5],[160,9,160,10],[162,1,162,8],[162,9,162,10],[163,1,163,8],[163,9,163,10],[164,1,164,8],[164,9,164,10],[165,1,165,4],[165,5,165,6],[165,7,165,8],[165,9,165,10],[167,9,167,10],[161,1,161,10],[159,1,159,5],[159,9,159,10],[168,1,168,8],[168,9,168,10],[169,1,169,10],[201,1,201,10],[193,9,193,10],[194,1,194,4],[194,5,194,6],[194,7,194,8],[194,9,194,10],[195,1,195,4],[195,5,195,6],[195,7,195,8],[193,7,193,8],[173,1,173,5],[174,1,174,5],[175,1,175,5],[177,1,177,8],[177,9,177,10],[178,1,178,8],[178,9,178,10],[180,5,180,6],[180,7,180,8],[180,9,180,10],[181,1,181,4],[181,5,181,6],[181,7,181,8],[181,9,181,10],[176,1,176,10],[184,1,184,10],[186,1,186,5],[187,1,187,5],[188,1,188,5],[179,1,179,8],[179,9,179,10],[183,1,183,8],[183,9,183,10],[182,1,182,4],[182,5,182,6],[182,7,182,8],[182,9,182,10],[8,22,8,26],[10,22,10,25],[11,22,11,23],[12,22,12,23],[13,22,13,23],[205,9,205,10],[206,1,206,4],[206,5,206,6],[206,7,206,8],[206,9,206,10],[180,1,180,4],[202,1,202,8],[202,9,202,10],[203,1,203,8],[203,9,203,10],[204,1,204,8],[204,9,204,10],[196,1,196,10],[186,6,186,7],[187,6,187,7],[188,6,188,7],[198,1,198,5],[199,1,199,5],[200,1,200,5],[18,22,18,26],[9,22,9,25],[28,22,28,23],[205,1,205,4],[205,5,205,6],[205,7,205,8],[208,1,208,10],[25,22,25,26],[26,22,26,25],[27,22,27,25],[207,1,207,4],[207,5,207,6],[207,7,207,8],[207,9,207,10],[195,9,195,10],[189,1,189,10],[190,1,190,8],[190,9,190,10],[191,1,191,8],[191,9,191,10],[192,1,192,8],[192,9,192,10],[193,1,193,4],[193,5,193,6]]}
[]
[null,"Tipologia Edificio",{"$f":"'Dati Gen'!B5","v":"Condominio"},null,null,null,null,null,null,null,null,null,"https://detrazionifiscali.enea.it/creaasseverazione.asp",null,null,null,null,null,null,null,null,null,null,null,{"$f":"NomeApp","v":"Pratica.110"},{"$f":"'Dati Gen'!J2","v":"Versione"},{"$f":"'Dati Gen'!K2","v":"1.9"}]
[null,"Data Inizio Lavori",{"$f":"'Dati Gen'!C31","v":"00:00:00"},null,null,null,null,null,null,null,null,null,null,null,null,null,null,null,null,null,null,null,null,null,{"$f":"'Dati Gen'!I3","v":"©2021 SIM srl - www.madosoft.it"}]
[null,"Comune Ubicazione",{"$f":"'Dati Gen'!C8","v":0}]
[null,"Comune Montano","X","SI",null,"NO","Elenco Comuni Montani"]
[null,"Interessato Infrazione",null,"SI","X","NO","Elenco Comuni Infrazioni"]
[null,"Intervento comma 4-Ter",null,"SI","X","NO","160% Zone Terremotate"]
[null,"Indirizzo",{"$f":"'Dati Gen'!C9","v":0},null,null,null,null,null,"N.Civico ",{"$f":"'Dati Gen'!K9","v":0},"CAP",{"$f":"'Dati Gen'!K8","v":0}]
[null,"Anno di Costruzione Immobile",{"$f":"'Dati Gen'!C11","v":0},null,null,null,{"$f":"'Dati Gen'!F11","v":"Superficie Totale Disperdente   :"},null,null,null,null,{"$f":"'Dati Gen'!K11","v":0},null,null,null,null,null,null,null,null,null,null,"Totali Progetto"]
[null,"Edificio in area Metanizzata","X","SI",null,"NO",null,null,null,null,null,null,null,null,null,null,null,null,null,null,null,null,"Spese previste in progetto",null,null,null,{"$f":"AA20+AA27","v":0}]
[null,"Autorizzazione Edilizia",{"$f":"'Dati Gen'!C12","v":"Licenza Edilizia / Titolo Edilizio"},null,null,null,null,null,{"$f":"'Dati Gen'!H12","v":"N."},{"$f":"'Dati Gen'!I12","v":0},{"$f":"'Dati Gen'!J12","v":"Data"},{"$f":"'Dati Gen'!K12","v":"00:00:00"},null,null,null,null,null,null,null,null,null,null,"Spese Ammissibili",null,null,null,{"$f":"AA21+AA28","v":0}]
[null,{"$f":"'Dati Gen'!B33","v":"Relazione ex Legge 10/91  Depositata al Comune in Data "},null,null,null,null,null,{"$f":"IF('Dati Gen'!G33<>\"\",'Dati Gen'!G33,\"\")","v":""},null,"Prot. N.",null,{"$f":"IF('Dati Gen'!K33<>\"\",'Dati Gen'!K33,\"\")","v":""},null,null,null,null,null,null,null,null,null,null,"Realizzati",null,"SAL 30%","SAL 60%","SAL FINALE"]
[null,null,null,null,null,null,null,null,null,null,null,null,null,null,null,null,null,null,null,null,null,null,"Costo Lavori Realizzati",null,{"$f":"Y23+Y30","v":{"$error":"#VALUE!"}},{"$error":"#VALUE!"},{"$error":"#VALUE!"}]
[null,"INTERVENTI TRAINANTI",null,null,null,null,null,null,null,null,null,null,null,null,null,null,null,null,null,null,null,null,"di cui ammessi",null,0,0,0]
[]
[null,"intervento di isolamento termico delle superfici opache verticali, orizzontali e inclinate "]
[null,"Descrizione",null,null,null,null,"Superficie mq","Trasm. Ante","Trasm. Post","Trasm.P. YIE","Confine","Coiben-tazione","Realizzati mq"]
[null,null,null,null,null,null,null,null,null,null,null,null,"SAL.30%","SAL.60%","SAL.FIN."]
[null,"Pareti Verticali in Blocchi di Tufo da 50cm",null,null,null,null,22.58,0.89139999999999997,0.22359999999999999,0.01,"Esterno","Esterna",22.58,null,null,null,null,null,null,null,null,null,"Totali Interventi Trainanti"]
[null,"Pareti Verticali in mattoni pieni da 30cm ",null,null,null,null,123.7,1.839,0.252,1.7299999999999999E-2,"Esterno","Esterna",123.7,null,null,null,null,null,null,null,null,null,"Spese previste in progetto",null,null,null,{"$f":"J33+J64","v":0}]
[null,"Pareti Verticali in blocchi di cemento da 30cm",null,null,null,null,22.88,1.3285,0.29099999999999998,1.9699999999999999E-2,"Esterno","Esterna",22.88,null,null,null,null,null,null,null,null,null,"Spese Ammissibili",null,null,null,{"$f":"J34+J65","v":0}]
[null,"Coperture Legno",null,null,null,null,76.14,2.1352000000000002,0.21909999999999999,8.3799999999999999E-2,"Esterno","Esterna",76.14,null,null,null,null,null,null,null,null,null,"Realizzati",null,"SAL 30%","SAL 60%","SAL FINALE"]
[null,"Coperture Acciaio",null,null,null,null,16.48,2.2898000000000001,0.21659999999999999,4.9799999999999997E-2,"Esterno","Esterna",16.48,null,null,null,null,null,null,null,null,null,"Costo Lavori Realizzati",null,{"$f":"F36+F67","v":{"$error":"#VALUE!"}},{"$f":"H36+H67","v":{"$error":"#VALUE!"}},{"$f":"J36+J67","v":{"$error":"#VALUE!"}}]
[null,null,null,null,null,null,null,null,null,null,null,null,null,null,null,null,null,null,null,null,null,null,"di cui ammessi",null,0,{"$f":"H37+H68","v":0},{"$f":"J37+J68","v":0}]
[null,null,null,null,null,null,null,null,null,null,"-","-"]
[null,null,null,null,null,null,null,null,null,null,"-","-",null,null,null,null,null,null,null,null,null,null,"Totali Interventi Trainati"]
[null,null,null,null,null,null,null,null,null,null,"-","-",null,null,null,null,null,null,null,null,null,null,"Spese previste in progetto",null,null,null,{"$f":"J87+J103+J133+J144+J154+J164+J179+J192+J204","v":0}]
[null,null,null,null,null,null,null,null,null,null,"-","-",null,null,null,null,null,null,null,null,null,null,"Spese Ammissibili",null,null,null,{"$f":"J88+J104+J134+J145+J155+J165+J180+J193+J205","v":0}]
[null,null,null,null,null,null,null,null,null,null,"-","-",null,null,null,null,null,null,null,null,null,null,"Realizzati",null,"SAL 30%","SAL 60%","SAL FINALE"]
[null,null,null,null,null,null,null,null,null,null,null,null,null,null,null,null,null,null,null,null,null,null,"Costo Lavori Realizzati",null,{"$f":"F90+F106+F167+F182+F195+F207","v":9536.23},{"$f":"H90+H106+H167+H182+H195+H207","v":0},{"$f":"J90+J106+J167+J182+J195+J207","v":0}]
[null,"Superficie Totale disperdente oggetto di intervento                              [mq]",null,null,null,null,null,null,null,{"$f":"SUM(G19:G29)","v":261.78000000000003},null,null,null,null,null,null,null,null,null,null,null,null,"di cui ammessi",null,0,{"$f":"H91+H107+H168+H183+H196+H208","v":0},{"$f":"J91+J107+J168+J183+J196+J208","v":0}]
[null,"Spesa Massima Ammissibile ",null,null,null,null,null,null,null,{"$f":"'SAL.30%'!Q18","v":120000}]
[null,"Costo Complessivo Previsto in progetto",null,null,null,null,null,null,null,{"$f":"'Computo-Massimali'!L19","v":0}]
[null,"Spesa Ammessa",null,null,null,null,null,null,null,{"$f":"IF(J33<J32,J33,J32)","v":0}]
[null,null,null,null,null,"SAL 30%",null,"SAL 60%",null,"SAL FINALE"]
[null,"Costo Lavori Realizzati",null,null,null,{"$f":"'SAL.30%'!L18","v":"Versione DEMO"},null,{"$f":"'SAL.60%'!L18","v":"Versione DEMO"},null,{"$f":"SAL.Finale!L18","v":"Versione DEMO"}]
[null,"di cui ammessi",null,null,null,{"$f":"IF(F36<$J$34,F36,$J$34)","v":0},null,{"$f":"IF(H36<$J$34,H36,$J$34)","v":0},null,{"$f":"IF(J36<$J$34,J36,$J$34)","v":0}]
[null,"Risparmio di energia primaria non rinnovabile di progetto    [kWh/anno]",null,null,null,null,null,null,null,10885]
[]
[]
[null,"Intervento di sostituzione degli impianti di climatizzazione invernale esistenti"]
[null,"Descrizione Nuovo Impianto",null,null,null,null,"Tipo Sostituito","P.Nom Sostituito","P.Nom kW","Rendim Util Nomin. 100%","Destinata","Efficienza  Riscaldam. hs","Efficienza  ACS hw","Tipo Aliment.","Classe Dispositivo Termoreg. Evoluto","Tipo PDC","Pot. El. Assorb kW","COP","Superfic. Risc. Da PDC",null,null,"Descrizione Impianto"]
[null,null,null,null,null,null,null,null,null,null,null,null,null,null,null,"-",null,null,null,null,null,"-"]
[null,null,null,null,null,null,"-",null,null,null,"-",null,null,"-","-","-",null,null,null,null,null,"CC) Caldaie a condensazione"]
[null,null,null,null,null,null,"-",null,null,null,"-",null,null,"-","-","-",null,null,null,null,null,"PC) Pompe di calore (PDC) a compressione di vapore elettriche anche sonde geotermiche"]
[null,null,null,null,null,null,"-",null,null,null,"-",null,null,"-","-","-",null,null,null,null,null,"PCA) Pompe di calore a gas ad assorbimento o a compressione di vapore azionate da motore primo"]
[null,null,null,null,null,null,"-",null,null,null,"-",null,null,"-","-","-",null,null,null,null,null,"CO) Sistemi microcogenerazione"]
[null,null,null,null,null,null,"-",null,null,null,"-",null,null,"-","-","-",null,null,null,null,null,"SA) Installazione di scaldacqua a pompa di calore in sostituzione di un sistema di produzione di acqua calda quando avviene con lo stesso generatore di calore destinato alla climatizzazione invernale ai sensi delle lettere b) e c) del comma 1 dell’articolo 119 del Decreto Rilancio"]
[null,null,null,null,null,null,"-",null,null,null,"-",null,null,"-","-","-",null,null,null,null,null,"ST) Collettori solari"]
[null,null,null,null,null,null,"-",null,null,null,"-",null,null,"-","-","-",null,null,null,null,null,"TR) Teleriscaldamento (esclusivamente per i comuni montani non interessati dalle procedure di infrazione comunitaria n. 2014/2147 del 10 luglio 2014 o n. 2015/2043 del 28 maggio 2015 per la non ottemperanza dell’Italia agli obblighi previsti dalla direttiva 2008/50/CE, l’allaccio a sistemi di teleriscaldamento efficiente ai sensi dell’articolo 2, comma 2, lettera tt), del decreto legislativo 4 luglio 2014, n. 102)"]
[]
[null,"SI) Sistemi Ibridi",null,null,null,null,"Tipo Sostituito","P.Nom Sostituito","Caldaia a Condensazione",null,null,null,"Pompa di Calore"]
[null,null,null,null,null,null,null,null,"P.Nom kW","Rendim Nomin. 100%","Efficienza  Riscaldam. hs","Tipo Aliment.","Tipo PDC","Tipo Roof Top","P.Nom    kW","Pot. El. Assorb kW","COP","Inverter","Sonde Geotermiche",null,null,"Tipo Sostituito"]
[null,null,null,null,null,1,"Generatori di Aria Calda",21.52,22,107.3,0.99,"Gas Naturale (metano)","Aria/Acqua","NO",6.4,1.3,5,"SI","NO",null,null,"-"]
[null,null,null,null,null,2,"-",null,null,null,null,"-","-","-",null,null,null,"-","-",null,null,"Caldaia Standard"]
[null,null,null,null,null,3,"-",null,null,null,null,"-","-","-",null,null,null,"-","-",null,null,"Caldaia Bassa Temperatura"]
[null,null,null,null,null,4,"-",null,null,null,null,"-","-","-",null,null,null,"-","-",null,null,"Caldaia a Condensazione Gas"]
[null,null,null,null,null,null,null,null,null,null,null,null,null,null,null,null,null,null,null,null,null,"Caldaia Condens.Gasolio"]
[null,"Destinati a :   Climatizzazione Invernale",null,null,null,null,"x",null,null,null,null,null,null,null,null,null,null,null,null,null,null,"Pompa di Calore anche con sonda geotermica"]
[null,"                         Climatizzazione estiva",null,null,null,null,null,null,null,null,null,null,null,null,null,null,null,null,null,null,null,"Generatori di Aria Calda"]
[null,"                         prod. di acqua calda sanitaria",null,null,null,null,"x",null,null,null,null,null,null,null,null,null,null,null,null,null,null,"Teleriscaldamento (solo in caso di distacco obbligato)"]
[null,null,null,null,null,null,null,null,null,null,null,null,null,null,null,null,null,null,null,null,null,"Impianto a biomassa"]
[null,"Spesa Massima Ammissibile ",null,null,null,null,null,null,null,{"$f":"'Computo-Massimali'!S27","v":60000},null,null,null,null,null,null,null,null,null,null,null,"Altro"]
[null,"Costo Complessivo Previsto in progetto",null,null,null,null,null,null,null,{"$f":"'Computo-Massimali'!L27","v":0}]
[null,"Spesa Ammessa",null,null,null,null,null,null,null,{"$f":"IF(J64<J63,J64,J63)","v":0}]
[null,null,null,null,null,"SAL 30%",null,"SAL 60%",null,"SAL FINALE"]
[null,"Costo Lavori Realizzati",null,null,null,{"$f":"'SAL.30%'!L26","v":"Versione DEMO"},null,{"$f":"'SAL.60%'!L26","v":"Versione DEMO"},null,{"$f":"SAL.Finale!L26","v":"Versione DEMO"}]
[null,"di cui ammessi",null,null,null,{"$f":"IF(F67<$J$65,F67,$J$65)","v":0},null,{"$f":"IF(H67<$J$65,H67,$J$65)","v":0},null,{"$f":"IF(J67<$J$65,J67,$J$65)","v":0}]
[null,"Risparmio di energia primaria non rinnovabile di progetto    [kWh/anno]",null,null,null,null,null,null,null,3544]
[]
[]
[]
[]
[null,"INTERVENTI TRAINATI"]
[]
[null,"Sostituzione degli infissi "]
[null,"Descrizione",null,null,null,null,"Telaio Prima","Vetro Prima",null,"Trasm. Ante","Superfice mq","Telaio Dopo","Vetro Dopo",null,"Trasm. Post","Chius. Oscura"]
[null,"Infissi in Legno 1 Anta Vetro Singolo con 1A2V",null,null,null,null,"Legno","Singolo",null,{"$f":"4.14","v":4.1399999999999997},{"$f":"0.7*0.95+0.65*1.15+0.9","v":2.3125},"Legno","Doppio",null,1.56,"X",null,null,null,null,null,{"$f":"IF(P78<>\"\",1,0)","v":1}]
[null,"Porte Ingresso",null,null,null,null,"Legno","Nessuno",null,5.15,{"$f":"0.9*2.3+1.15*2.2+2","v":6.6},"Legno","Nessuno",null,1.6,null,null,null,null,null,null,0]
[null,null,null,null,null,null,null,null,null,null,null,null,null,null,null,null,null,null,null,null,null,0]
[null,null,null,null,null,null,"-","-",null,null,null,"-","-",null,null,null,null,null,null,null,null,0]
[null,null,null,null,null,null,"-","-",null,null,null,"-","-",null,null,null,null,null,null,null,null,0]
[null,null,null,null,null,null,"-","-",null,null,null,"-","-",null,null,null,null,null,null,null,null,0]
[null,null,null,null,null,null,"-","-",null,null,null,"-","-",null,null,null,null,null,null,null,null,0]
[null,null,null,null,null,null,null,null,null,null,null,null,null,null,null,null,null,null,null,null,null,{"$f":"SUM(V78:V84)","v":1}]
[null,"Spesa Massima Ammissibile ",null,null,null,null,null,null,null,{"$f":"IF(V85>0,'Computo-Massimali'!S21,'Computo-Massimali'!S20)","v":163636.36363636362}]
[null,"Costo Complessivo Previsto in progetto",null,null,null,null,null,null,null,{"$f":"IF(V85>0,'Computo-Massimali'!L21,'Computo-Massimali'!L20)","v":0}]
[null,"Spesa Ammessa",null,null,null,null,null,null,null,{"$f":"IF(J87<J86,J87,J86)","v":0}]
[null,null,null,null,null,"SAL 30%",null,"SAL 60%",null,"SAL FINALE"]
[null,"Costo Lavori Realizzati",null,null,null,{"$f":"IF(V85>0,'SAL.30%'!L20,'SAL.30%'!L19)","v":1748.23},null,{"$f":"IF(V85>0,'SAL.60%'!L20,'SAL.60%'!L19)","v":0},null,{"$f":"IF(V85>0,SAL.Finale!L20,SAL.Finale!L19)","v":0}]
[null,"di cui ammessi",null,null,null,{"$f":"IF(F90<$J$88,F90,$J$88)","v":0},null,{"$f":"IF(H90<$J$88,H90,$J$88)","v":0},null,{"$f":"IF(J90<$J$88,J90,$J$88)","v":0}]
[null,"Risparmio di energia primaria non rinnovabile di progetto    [kWh/anno]",null,null,null,null,null,null,null,485.6]
[]
[null,"Schermature solari e chiusure oscuranti"]
[null,"Descrizione",null,null,null,null,"Tipo Schermatura","Installazione",null,"Superf. Schermatura","Superfice finestra protetta","Resistenza term. suppl m2K/W","Orientamento","Tipo Calcolo",null,"gtot","Materiale schermatura",null,"Meccan. Regolaz."]
[null,null,null,null,null,null,"-","-",null,null,null,null,"-","-",null,null,"-",null,"-"]
[null,null,null,null,null,null,"-","-",null,null,null,null,"-","-",null,null,"-",null,"-"]
[null,null,null,null,null,null,"-","-",null,null,null,null,"-","-",null,null,"-",null,"-"]
[null,null,null,null,null,null,"-","-",null,null,null,null,"-","-",null,null,"-",null,"-"]
[null,null,null,null,null,null,"-","-",null,null,null,null,"-","-",null,null,"-",null,"-"]
[]
[null,"Spesa Massima Ammissibile ",null,null,null,null,null,null,null,{"$f":"'Computo-Massimali'!S23","v":163636.36363636362}]
[null,"Costo Complessivo Previsto in progetto",null,null,null,null,null,null,null,{"$f":"'Computo-Massimali'!L23","v":0}]
[null,"Spesa Ammessa",null,null,null,null,null,null,null,{"$f":"IF(J103<J102,J103,J102)","v":0}]
[null,null,null,null,null,"SAL 30%",null,"SAL 60%",null,"SAL FINALE"]
[null,"Costo Lavori Realizzati",null,null,null,{"$f":"'SAL.30%'!L22","v":0},null,{"$f":"'SAL.60%'!L22","v":0},null,{"$f":"SAL.Finale!L22","v":0}]
[null,"di cui ammessi",null,null,null,{"$f":"IF(F106<$J$104,F106,$J$104)","v":0},null,{"$f":"IF(H106<$J$104,H106,$J$104)","v":0},null,{"$f":"IF(J106<$J$104,J106,$J$104)","v":0}]
[null,"Risparmio di energia primaria non rinnovabile di progetto    [kWh/anno]"]
[]
[]
[null,"Impianti a)"]
[null,"CC) Caldaie a condensazione",null,null,null,null,"Tipo Sostituito","P.Nom Sostituito","P.Nom kW","Rendim Util Nomin. 100%","Destinata","Efficienza  Riscaldam. hs","Efficienza  ACS     hw","Tipo Aliment.","Classe Dispositivo Termoreg. Evoluto"]
[null,null,null,null,null,null,"-",null,null,null,"-",null,null,"-","-"]
[null,null,null,null,null,null,"-",null,null,null,"-",null,null,"-","-"]
[]
[null,"GA) Generatori di aria calda a condensazione",null,null,null,null,"Tipo Sostituito","P.Nom Sostituito","P.Nom kW","Rendim Util Nomin. 100%","Tipo Aliment."]
[null,null,null,null,null,null,"-",null,null,null,"-"]
[null,null,null,null,null,null,"-",null,null,null,"-"]
[]
[null,"PC) Pompe di calore (PDC) a compressione di vapore elettriche anche sonde geotermiche",null,null,null,null,"Tipo Sostituito","P.Nom Sostituito","Tipo PDC","Tipo Roof Top","P.Nom kW","Pot. El. Assorb kW","Inverter","COP","Reversibile","Sonde Geotermiche","Sup. Riscald. dalla PDC"]
[null,null,null,null,null,null,"-",null,"-","-",null,null,"-",null,"-","-"]
[null,null,null,null,null,null,"-",null,"-","-",null,null,"-",null,"-","-"]
[]
[null,"PCA) Pompe di calore a gas ad assorbimento o a compressione di vapore azionate da motore primo",null,null,null,null,"Tipo Sostituito","P.Nom Sostituito","Tipo PDC","Tipo Roof Top","P.Nom kW","Inverter","GUEh","Reversibile","GUEc","Sup. Riscald. Dalla PDC"]
[null,null,null,null,null,null,"-",null,"-","-",null,"-",null,"-"]
[null,null,null,null,null,null,"-",null,"-","-",null,"-",null,"-"]
[]
[null,"SA) Scaldacqua a pompa di calore",null,null,null,null,"Tipo Sostituito","Pu. scald. sostituito kW","Pu. scald. PDC  kW","COP nuovo scald.","Capacità accumulo litri"]
[null,null,null,null,null,null,"-"]
[null,null,null,null,null,null,"-"]
[]
[null,"Spesa Massima Ammissibile per Impianti a)",null,null,null,null,null,null,null,{"$f":"27272*N_Uimm","v":81816}]
[null,"Spese Previste in progetto per Impianti a)",null,null,null,null,null,null,null,0]
[null,"Spesa Ammessa",null,null,null,null,null,null,null,{"$f":"IF(J133<J132,J133,J132)","v":0}]
[null,"Risparmio di energia primaria non rinnovabile di progetto    [kWh/anno]"]
[]
[]
[]
[null,"CO) Sistemi microcogenerazione ",null,null,null,null,"Tipo Sostituito","P.Nom Sostituito","Pot. Elettr. kW","Pot. Immes. kW","Pot. Term. Rec. kW","PES %","Tipo Aliment.","Tipo Intervent","a Celle Combust.","Riscaldatore Supplement.","P.Risc. Supp kW","Efficienz hs %","Classe Energet"]
[null,null,null,null,null,null,"-",null,null,null,null,null,"-","-","-","-",null,null,"-"]
[null,null,null,null,null,null,"-",null,null,null,null,null,"-","-","-","-",null,null,"-"]
[]
[null,"Spesa Massima Ammissibile per CO) Sistemi Microgenerazione",null,null,null,null,null,null,null,{"$f":"90909*N_Uimm","v":272727}]
[null,"Spese Previste in progetto per CO) Microgenerazione",null,null,null,null,null,null,null,0]
[null,"Spesa Ammessa",null,null,null,null,null,null,null,{"$f":"IF(J144<J143,J144,J143)","v":0}]
[null,"Risparmio di energia primaria non rinnovabile di progetto    [kWh/anno]"]
[]
[]
[null,"IB) Generatori a biomassa installazione, di impianti di climatizzazione invernale dotati di generatori di calore alimentati da biomasse combustibili ",null,null,null,null,"Tipo Sostituito","P.Nom Sostituito","Classe Gener. re","Tipo Generatore",null,"Impianto destinato a","Tipo Aliment.","P.u.      kW","P. al focolare kW","Rendimento a P. nom.","Sup. Riscald mq",null,null,null,null,"Tipo Generatore"]
[null,null,null,null,null,null,"-",null,"-",null,null,"-","-",null,null,null,null,null,null,null,null,"-"]
[null,null,null,null,null,null,"-",null,"-",null,null,"-","-",null,null,null,null,null,null,null,null,"Caldaia"]
[null,null,null,null,null,null,null,null,null,null,null,null,null,null,null,null,null,null,null,null,null,"Stufe"]
[null,"Spesa Massima Ammissibile per IB) Generatori a biomassa",null,null,null,null,null,null,null,{"$f":"27272*N_Uimm","v":81816},null,null,null,null,null,null,null,null,null,null,null,"Camini"]
[null,"Spese Previste in progetto per IB) Generatori a biomassa",null,null,null,null,null,null,null,0,null,null,null,null,null,null,null,null,null,null,null,"Termostufe"]
[null,"Spesa Ammessa",null,null,null,null,null,null,null,{"$f":"IF(J154<J153,J154,J153)","v":0},null,null,null,null,null,null,null,null,null,null,null,"Cucine a legna"]
[null,"Risparmio di energia primaria non rinnovabile di progetto    [kWh/anno]"]
[]
[]
[null,"BA) Building Automation",null,null,null,null,"Controllo Climatizzaz. Invernale","Controllo Climatizz. Estiva","Controllo ACS","Classe Sistema Esistente",null,"Classe Sistema Dopo interv.","Superfici Ambienti Contr."]
[null,null,null,null,null,null,"SI","NO","SI","D (Assenza di sistema automazione)",null,"A",85]
[null,null,null,null,null,null,"-","-","-",null,null,"-"]
[]
[null,"Spesa Massima Ammissibile per BA) Building Automation",null,null,null,null,null,null,null,{"$f":"13636*N_Uimm","v":40908}]
[null,"Spese Previste in progetto per BA) Building Automation",null,null,null,null,null,null,null,{"$f":"'Computo-Massimali'!L30","v":0}]
[null,"Spesa Ammessa",null,null,null,null,null,null,null,{"$f":"IF(J164<J163,J164,J163)","v":0}]
[null,null,null,null,null,"SAL 30%",null,"SAL 60%",null,"SAL FINALE"]
[null,"Costo Lavori Realizzati",null,null,null,{"$f":"'SAL.30%'!L29","v":0},null,{"$f":"'SAL.60%'!L29","v":0},null,{"$f":"SAL.Finale!L29","v":0}]
[null,"di cui ammessi",null,null,null,{"$f":"IF(F167<$J$165,F167,$J$165)","v":0},null,{"$f":"IF(H167<$J$165,H167,$J$165)","v":0},null,{"$f":"IF(J167<$J$165,J167,$J$165)","v":0}]
[null,"Risparmio di energia primaria non rinnovabile di progetto    [kWh/anno]",null,null,null,null,null,null,null,407]
[]
[]
[]
[]
[null,"ST) Collettori Solari",null,null,null,null,"Sup lorda Ag singolo modulo","N. di moduli","S.tot","Tipo di colllettori","Tipo di installazione","Inclinaz. %","Orientamento","Factory Made","Qcol / Qsol kWht  oppure    QL MJ","Accumulo   litri","Dest. Calore","Solar Keymrk","Tipo impianto sost."]
[null,null,null,null,null,null,2.52,2,{"$f":"G175*H175","v":5.04},"Piani Vetrati","Tetto a Falda",0.3,"sud-est","SI",1210,410,"Produzione ACS e RISC","SI","Boiler elettrico"," "]
[null,null,null,null,null,null,null,null,{"$f":"G176*H176","v":0},"-","-",null,"-","-",null,null,"-","-","-"]
[]
[null,"Spesa Massima Ammissibile per ST) Collettori Solari",null,null,null,null,null,null,null,{"$f":"54545*N_Uimm","v":163635}]
[null,"Spese Previste in progetto per ST) Collettori Solari",null,null,null,null,null,null,null,{"$f":"'Computo-Massimali'!L24","v":0}]
[null,"Spesa Ammessa",null,null,null,null,null,null,null,{"$f":"IF(J179<J178,J179,J178)","v":0}]
[null,null,null,null,null,"SAL 30%",null,"SAL 60%",null,"SAL FINALE"]
[null,"Costo Lavori Realizzati",null,null,null,{"$f":"'SAL.30%'!L23","v":0},null,{"$f":"'SAL.60%'!L23","v":0},null,{"$f":"SAL.Finale!L23","v":0}]
[null,"di cui ammessi",null,null,null,{"$f":"IF(F182<$J$180,F182,$J$180)","v":0},null,{"$f":"IF(H182<$J$180,H182,$J$180)","v":0},null,{"$f":"IF(J182<$J$180,J182,$J$180)","v":0}]
[null,"Risparmio di energia primaria non rinnovabile di progetto    [kWh/anno]"]
[]
[]
[null,"FV) Fotovoltaico",null,null,null,null,"Codice POD",null,"Potenza Picco kW"]
[null,null,null,null,null,null,"IT001E929072154",null,6]
[]
[]
[null,"Spesa Massima Ammissibile per FV) Fotovoltaico",null,null,null,null,null,null,null,{"$f":"'Computo-Massimali'!S25","v":14400}]
[null,"Spese Previste in progetto per FV) Fotovoltaico",null,null,null,null,null,null,null,{"$f":"'Computo-Massimali'!L25","v":0}]
[null,"Spesa Ammessa",null,null,null,null,null,null,null,{"$f":"IF(J192<J191,J192,J191)","v":0}]
[null,null,null,null,null,"SAL 30%",null,"SAL 60%",null,"SAL FINALE"]
[null,"Costo Lavori Realizzati",null,null,null,{"$f":"'SAL.30%'!L24","v":7788},null,{"$f":"'SAL.60%'!L24","v":0},null,{"$f":"SAL.Finale!L24","v":0}]
[null,"di cui ammessi",null,null,null,{"$f":"IF(F195<$J$193,F195,$J$193)","v":0},null,{"$f":"IF(H195<$J$193,H195,$J$193)","v":0},null,{"$f":"IF(J195<$J$193,J195,$J$193)","v":0}]
[]
[]
[null,"AC) Sistema di Accumulo",null,null,null,null,"Capacità kWh"]
[null,null,null,null,null,null,10]
[]
[]
[null,"Spesa Massima Ammissibile perAC) Sistema di Accumulo",null,null,null,null,null,null,null,{"$f":"'Computo-Massimali'!S26","v":10000}]
[null,"Spese Previste in progetto per AC) Sistema di Accumulo",null,null,null,null,null,null,null,{"$f":"'Computo-Massimali'!L26","v":0}]
[null,"Spesa Ammessa",null,null,null,null,null,null,null,{"$f":"IF(J204<J203,J204,J203)","v":0}]
[null,null,null,null,null,"SAL 30%",null,"SAL 60%",null,"SAL FINALE"]
[null,"Costo Lavori Realizzati",null,null,null,{"$f":"'SAL.30%'!L25","v":0},null,{"$f":"'SAL.60%'!L25","v":0},null,{"$f":"SAL.Finale!L25","v":0}]
[null,"di cui ammessi",null,null,null,{"$f":"IF(F207<$J$205,F207,$J$205)","v":0},null,{"$f":"IF(H207<$J$205,H207,$J$205)","v":0},null,{"$f":"IF(J207<$J$205,J207,$J$205)","v":0}]

{"sheet":"Fatture","index":6,"n_rows":141,"n_cols":18,"rows_kept":141,"cut":false,"hidden":false,"merged":[[140,1,140,4],[132,9,132,12],[117,9,117,12],[21,16,21,17],[71,16,71,17],[121,16,121,17]]}
[]
[null,{"$f":"CONCATENATE('SAL.30%'!C3,\" del \",'SAL.30%'!C4)","v":"STATO AVANZAMENTO LAVORI N.1 del 26/06/2021"},null,null,null,null,null,null,null,{"$f":"B2","v":"STATO AVANZAMENTO LAVORI N.1 del 26/06/2021"}]
[null,"FATTURA x SUPERBONUS  110%",null,null,null,null,null,null,null,"FATTURA x LAVORI RISTRUTTURAZIONE"]
[null,"Descrizione","Imponibile","Aliq.Iva","Iva","Importo",null,"Ecced.Max Spesa",null,"Descrizione","Imponibile","Aliq.Iva","Iva","Importo"]
[null,{"$f":"'SAL.30%'!C18","v":"Isolamento sup. verticali e/o orizzontali"},{"$f":"'SAL.30%'!H18","v":34259.040000000001},0.1,{"$f":"C5*D5","v":3425.9040000000005},{"$f":"C5+E5","v":37684.944000000003},null,{"$f":"IF('SAL.30%'!L18>'SAL.30%'!Q18,'SAL.30%'!Q18-'SAL.30%'!L18,0)","v":{"$error":"#VALUE!"}},null,{"$f":"'SAL.30%'!C35","v":"Lavori Ristrutturazione"},{"$f":"'SAL.30%'!H35","v":3635.41},0.1,{"$f":"K5*L5","v":363.541},{"$f":"K5+M5","v":3998.951}]
[null,{"$f":"'SAL.30%'!C21","v":"Serramenti + chiusure oscuranti"},{"$f":"'SAL.30%'!H21","v":1589.3},0.1,{"$f":"C6*D6","v":158.93},{"$f":"C6+E6","v":1748.23},null,{"$f":"IF('SAL.30%'!L21>'SAL.30%'!Q21,'SAL.30%'!Q21-'SAL.30%'!L21,0)","v":0},null,{"$f":"'SAL.30%'!C36","v":0},{"$f":"'SAL.30%'!H36","v":0},0.1,{"$f":"K6*L6","v":0},{"$f":"K6+M6","v":0}]
[null,{"$f":"'SAL.30%'!C22","v":"Schermature solari "},{"$f":"'SAL.30%'!H22","v":0},0.1,{"$f":"C7*D7","v":0},{"$f":"C7+E7","v":0},null,{"$f":"IF('SAL.30%'!L22>'SAL.30%'!Q22,'SAL.30%'!Q22-'SAL.30%'!L22,0)","v":0},null,{"$f":"CONCATENATE(\"Spese Tecniche x \",J5)","v":"Spese Tecniche x Lavori Ristrutturazione"},{"$f":"'SAL.30%'!K35/(1+L7)","v":0},0.22,{"$f":"K7*L7","v":0},{"$f":"M7+K7","v":0}]
[null,{"$f":"'SAL.30%'!C23","v":"Solare Termico    - con collettori solari"},{"$f":"'SAL.30%'!H23","v":0},0.1,0,0,null,{"$f":"IF('SAL.30%'!L23>'SAL.30%'!Q23,'SAL.30%'!Q23-'SAL.30%'!L23,0)","v":0},null,{"$f":"CONCATENATE(\"Spese Tecniche x \",J6)","v":"Spese Tecniche x 0"},{"$f":"'SAL.30%'!K36/(1+L8)","v":0},0.22,{"$f":"K8*L8","v":0},{"$f":"M8+K8","v":0}]
[null,{"$f":"'SAL.30%'!C24","v":"Solare Fotovoltaico             kWp"},{"$f":"'SAL.30%'!H24","v":7080},0.1,708,7788,null,{"$f":"IF('SAL.30%'!L24>'SAL.30%'!Q24,'SAL.30%'!Q24-'SAL.30%'!L24,0)","v":0}]
[null,{"$f":"'SAL.30%'!C25","v":"Sistema di Accumulo              kWh"},{"$f":"'SAL.30%'!H25","v":0},0.1,0,0,null,{"$f":"IF('SAL.30%'!L25>'SAL.30%'!Q25,'SAL.30%'!Q25-'SAL.30%'!L25,0)","v":0},null,null,null,null,"Oneri Attualizzazione Credito / Quota Sconto  ",{"$f":"'SAL.30%'!N37*(1-'Computo-Massimali'!H44)","v":249.9344375}]
[null,{"$f":"'SAL.30%'!C26","v":"Impianti climatizzazione e ACS"},{"$f":"'SAL.30%'!H26","v":0},0.1,0,0,null,{"$f":"IF('SAL.30%'!L26>'SAL.30%'!Q26,'SAL.30%'!Q26-'SAL.30%'!L26,0)","v":{"$error":"#VALUE!"}}]
[null,{"$f":"'SAL.30%'!C27","v":"Sistemi di Microgenerazione"},{"$f":"'SAL.30%'!H27","v":0},0.1,0,0,null,{"$f":"IF('SAL.30%'!L27>'SAL.30%'!Q27,'SAL.30%'!Q27-'SAL.30%'!L27,0)","v":0},null,null,null,null,"Totale Imponibile",{"$f":"SUM(K5:K8)","v":3635.41}]
[null,{"$f":"'SAL.30%'!C28","v":"Impianti Biomassa"},{"$f":"'SAL.30%'!H28","v":0},0.1,0,0,null,{"$f":"IF('SAL.30%'!L28>'SAL.30%'!Q28,'SAL.30%'!Q28-'SAL.30%'!L28,0)","v":0},null,null,null,null,"Totale IVA",{"$f":"SUM(M5:M8)","v":363.541}]
[null,{"$f":"'SAL.30%'!C29","v":"Sistemi di Building Automation"},{"$f":"'SAL.30%'!H29","v":0},0.1,0,0,null,{"$f":"IF('SAL.30%'!L29>'SAL.30%'!Q29,'SAL.30%'!Q29-'SAL.30%'!L29,0)","v":0},null,null,null,null,"Totale Fattura",{"$f":"SUM(N5:N8)","v":3998.951}]
[null,{"$f":"'SAL.30%'!C30","v":"Colonnine di Ricarica"},{"$f":"'SAL.30%'!H30","v":0},0.1,0,0,null,{"$f":"IF('SAL.30%'!L30>'SAL.30%'!Q30,'SAL.30%'!Q30-'SAL.30%'!L30,0)","v":0},null,null,null,null,"Sconto in Fattura ",{"$f":"-'SAL.30%'!N37+N10","v":-1749.5410625}]
[null,{"$f":"'SAL.30%'!C31","v":"Eliminazione Barriere architettoniche"},{"$f":"'SAL.30%'!H31","v":0},0.1,0,0,null,{"$f":"IF('SAL.30%'!L31>'SAL.30%'!Q31,'SAL.30%'!Q31-'SAL.30%'!L31,0)","v":0},null,null,null,null,"Netto a Pagare",{"$f":"N14+N15","v":2249.4099375000001}]
[null,{"$f":"'SAL.30%'!C32","v":"SismaBonus"},{"$f":"'SAL.30%'!H32","v":0},0.1,0,0,null,{"$f":"IF('SAL.30%'!L32>'SAL.30%'!Q32,'SAL.30%'!Q32-'SAL.30%'!L32,0)","v":0}]
[null,{"$f":"CONCATENATE(\"Spese Tecniche x \",B5)","v":"Spese Tecniche x Isolamento sup. verticali e/o orizzontali"},{"$f":"'SAL.30%'!K18/(1+D18)","v":0},0.22,0,{"$f":"E18+C18","v":0}]
[null,"Spese Tecniche x Serramenti + chiusure oscuranti",{"$f":"'SAL.30%'!K21/(1+D19)","v":0},0.22,0,0]
[null,"Spese Tecniche x Schermature solari ",{"$f":"'SAL.30%'!K22/(1+D20)","v":0},0.22,0,0]
[null,"Spese Tecniche x Solare Termico    - con collettori solari",{"$f":"'SAL.30%'!K23/(1+D21)","v":0},0.22,0,0,null,"Totali Sp.Tec",null,{"$f":"B2","v":"STATO AVANZAMENTO LAVORI N.1 del 26/06/2021"}]
[null,"Spese Tecniche x Solare Fotovoltaico             kWp",{"$f":"'SAL.30%'!K24/(1+D22)","v":0},0.22,0,0,null,{"$f":"SUM(F18:F30) +SUM(N7:N8)","v":0},null,"Ripartizione Spese Tecniche","Imponibile","Aliq.Iva","Iva","Importo",null,null,"Applica Sconto Diretto"]
[null,"Spese Tecniche x Sistema di Accumulo              kWh",{"$f":"'SAL.30%'!K25/(1+D23)","v":0},0.22,0,0,null,null,null,{"$f":"'Computo-Massimali'!S3","v":"Ape Ante"},{"$f":"$H$22*('Computo-Massimali'!$U$3+'Computo-Massimali'!$X$3)/'Computo-Massimali'!$AC$13","v":0},{"$f":"'Computo-Massimali'!$Z$3","v":0.22},{"$f":"L23*K23","v":0},{"$f":"M23+K23","v":0},null,null,"NO",{"$f":"IF(Q23=\"SI\",N23,0)","v":0}]
[null,"Spese Tecniche x Impianti climatizzazione e ACS",{"$f":"'SAL.30%'!K26/(1+D24)","v":0},0.22,0,0,null,null,null,{"$f":"'Computo-Massimali'!S4","v":"Progettazione e DL"},{"$f":"$H$22*('Computo-Massimali'!$U$4+'Computo-Massimali'!$X$4)/'Computo-Massimali'!$AC$13","v":0},{"$f":"'Computo-Massimali'!$Z$4","v":0.22},0,0,null,null,"NO",{"$f":"IF(Q24=\"SI\",N24,0)","v":0}]
[null,"Spese Tecniche x Sistemi di Microgenerazione",{"$f":"'SAL.30%'!K27/(1+D25)","v":0},0.22,0,0,null,null,null,{"$f":"'Computo-Massimali'!S5","v":"Coord.SicurezzaEsec."},{"$f":"$H$22*('Computo-Massimali'!$U$5+'Computo-Massimali'!$X$5)/'Computo-Massimali'!$AC$13","v":0},{"$f":"'Computo-Massimali'!$Z$5","v":0.22},0,0,null,null,"NO",0]
[null,"Spese Tecniche x Impianti Biomassa",{"$f":"'SAL.30%'!K28/(1+D26)","v":0},0.22,0,0,null,null,null,{"$f":"'Computo-Massimali'!S6","v":"Ape Post"},{"$f":"$H$22*('Computo-Massimali'!$U$6+'Computo-Massimali'!$X$6)/'Computo-Massimali'!$AC$13","v":0},{"$f":"'Computo-Massimali'!$Z$6","v":0.22},0,0,null,null,"NO",0]
[null,"Spese Tecniche x Sistemi di Building Automation",{"$f":"'SAL.30%'!K29/(1+D27)","v":0},0.22,0,0,null,null,null,{"$f":"'Computo-Massimali'!S7","v":0},{"$f":"$H$22*('Computo-Massimali'!$U$7+'Computo-Massimali'!$X$7)/'Computo-Massimali'!$AC$13","v":0},{"$f":"'Computo-Massimali'!$Z$7","v":0},0,0,null,null,"NO",0]
[null,"Spese Tecniche x Colonnine di Ricarica",{"$f":"'SAL.30%'!K30/(1+D28)","v":0},0.22,0,0,null,null,null,{"$f":"'Computo-Massimali'!S8","v":0},{"$f":"$H$22*('Computo-Massimali'!$U$8+'Computo-Massimali'!$X$8)/'Computo-Massimali'!$AC$13","v":0},{"$f":"'Computo-Massimali'!$Z$8","v":0},0,0,null,null,"NO",0]
[null,"Spese Tecniche x Eliminazione Barriere architettoniche",{"$f":"'SAL.30%'!K31/(1+D29)","v":0},0.22,0,0,null,null,null,{"$f":"'Computo-Massimali'!S9","v":0},{"$f":"$H$22*('Computo-Massimali'!$U$9+'Computo-Massimali'!$X$9)/'Computo-Massimali'!$AC$13","v":0},{"$f":"'Computo-Massimali'!$Z$9","v":0},0,0,null,null,"NO",0]
[null,"Spese Tecniche x SismaBonus",{"$f":"'SAL.30%'!K32/(1+D30)","v":0},0.22,0,0,null,null,null,{"$f":"'Computo-Massimali'!S12","v":"Visto Conformità"},{"$f":"$H$22*('Computo-Massimali'!$V$12+'Computo-Massimali'!$X$12)/'Computo-Massimali'!$AC$13","v":0},{"$f":"'Computo-Massimali'!$Z$12","v":0.22},0,0,null,null,"NO",0]
[null,null,null,null,null,null,null,null,null,null,null,null,null,{"$f":"SUM(N23:N30)","v":0},null,null,null,{"$f":"SUM(R23:R30)","v":0}]
[null,null,null,null,"Totale Imponibile",{"$f":"SUM(C5:C30)","v":42928.340000000004}]
[null,null,null,null,"A detrarre Importi Direttamente fatturati da Tecnici che applicano sconto in fattura",{"$f":"-R31/(1+D18)","v":0}]
[null,null,null,null,"Sommano",{"$f":"SUM(F32:F33)","v":42928.340000000004}]
[null,null,null,null,"Totale IVA",{"$f":"SUM(E5:E30)-R31*D18","v":4292.8340000000007}]
[null,null,null,null,"Totale Fattura",{"$f":"SUM(F5:F30)-R31","v":47221.174000000006}]
[null,null,null,null,"Sconto in Fattura (Spese ammesse)",{"$f":"-(F36+SUM(H5:H17))","v":{"$error":"#VALUE!"}}]
[null,null,null,null,"Netto a Pagare",{"$f":"F36+F37","v":{"$error":"#VALUE!"}}]
[]
[]
[]
[]
[]
[]
[]
[]
[]
[]
[]
[]
[]
[null,{"$f":"CONCATENATE('SAL.60%'!C3,\" del \",'SAL.60%'!C4)","v":"STATO AVANZAMENTO LAVORI N.2 del 26/07/2021"},null,null,null,null,null,null,null,{"$f":"B52","v":"STATO AVANZAMENTO LAVORI N.2 del 26/07/2021"}]
[null,"FATTURA x SUPERBONUS  110%",null,null,null,null,null,null,null,"FATTURA x LAVORI RISTRUTTURAZIONE"]
[null,"Descrizione","Imponibile","Aliq.Iva","Iva","Importo",null,"Ecced.Max Spesa",null,"Descrizione","Imponibile","Aliq.Iva","Iva","Importo"]
[null,{"$f":"'SAL.60%'!C18","v":"Isolamento sup. verticali e/o orizzontali"},{"$f":"IF('SAL.60%'!H18>0,'SAL.60%'!H18-C5,0)","v":0},0.1,{"$f":"C55*D55","v":0},{"$f":"C55+E55","v":0},null,{"$f":"IF('SAL.60%'!L18>'SAL.60%'!Q18,'SAL.60%'!Q18-'SAL.60%'!L18,0)","v":{"$error":"#VALUE!"}},null,{"$f":"'SAL.60%'!C35","v":"Lavori Ristrutturazione"},{"$f":"IF('SAL.60%'!H35>0,'SAL.60%'!H35-K5,0)","v":0},0.1,{"$f":"K55*L55","v":0},{"$f":"K55+M55","v":0}]
[null,{"$f":"'SAL.60%'!C21","v":"Serramenti + chiusure oscuranti"},{"$f":"IF('SAL.60%'!H21>0,'SAL.60%'!H21-C6,0)","v":0},0.1,{"$f":"C56*D56","v":0},{"$f":"C56+E56","v":0},null,{"$f":"IF('SAL.60%'!L21>'SAL.60%'!Q21,'SAL.60%'!Q21-'SAL.60%'!L21,0)","v":0},null,{"$f":"'SAL.60%'!C36","v":0},{"$f":"IF('SAL.60%'!H36>0,'SAL.60%'!H36-K6,0)","v":0},0.1,{"$f":"K56*L56","v":0},{"$f":"K56+M56","v":0}]
[null,{"$f":"'SAL.60%'!C22","v":"Schermature solari "},{"$f":"IF('SAL.60%'!H22>0,'SAL.60%'!H22-C7,0)","v":0},0.1,{"$f":"C57*D57","v":0},{"$f":"C57+E57","v":0},null,{"$f":"IF('SAL.60%'!L22>'SAL.60%'!Q22,'SAL.60%'!Q22-'SAL.60%'!L22,0)","v":0},null,{"$f":"CONCATENATE(\"Spese Tecniche x \",J55)","v":"Spese Tecniche x Lavori Ristrutturazione"},{"$f":"IF('SAL.60%'!K35>0,('SAL.60%'!K35-'SAL.30%'!K35)/(1+L57),0)","v":0},0.22,{"$f":"K57*L57","v":0},{"$f":"M57+K57","v":0}]
[null,{"$f":"'SAL.60%'!C23","v":"Solare Termico    - con collettori solari"},{"$f":"IF('SAL.60%'!H23>0,'SAL.60%'!H23-C8,0)","v":0},0.1,0,0,null,{"$f":"IF('SAL.60%'!L23>'SAL.60%'!Q23,'SAL.60%'!Q23-'SAL.60%'!L23,0)","v":0},null,{"$f":"CONCATENATE(\"Spese Tecniche x \",J56)","v":"Spese Tecniche x 0"},{"$f":"IF('SAL.60%'!K36>0,('SAL.60%'!K36-'SAL.30%'!K36)/(1+L58),0)","v":0},0.22,{"$f":"K58*L58","v":0},{"$f":"M58+K58","v":0}]
[null,{"$f":"'SAL.60%'!C24","v":"Solare Fotovoltaico             kWp"},{"$f":"IF('SAL.60%'!H24>0,'SAL.60%'!H24-C9,0)","v":0},0.1,0,0,null,{"$f":"IF('SAL.60%'!L24>'SAL.60%'!Q24,'SAL.60%'!Q24-'SAL.60%'!L24,0)","v":0}]
[null,{"$f":"'SAL.60%'!C25","v":"Sistema di Accumulo             kWp"},{"$f":"IF('SAL.60%'!H25>0,'SAL.60%'!H25-C10,0)","v":0},0.1,0,0,null,{"$f":"IF('SAL.60%'!L25>'SAL.60%'!Q25,'SAL.60%'!Q25-'SAL.60%'!L25,0)","v":0},null,null,null,null,"Oneri Attualizzazione Credito / Quota Sconto  ",{"$f":"IF('SAL.60%'!N37>0,('SAL.60%'!N37-'SAL.30%'!N37)*(1-'Computo-Massimali'!H44),0)","v":0}]
[null,{"$f":"'SAL.60%'!C26","v":"Impianti climatizzazione e ACS"},{"$f":"IF('SAL.60%'!H26>0,'SAL.60%'!H26-C11,0)","v":0},0.1,0,0,null,{"$f":"IF('SAL.60%'!L26>'SAL.60%'!Q26,'SAL.60%'!Q26-'SAL.60%'!L26,0)","v":{"$error":"#VALUE!"}}]
[null,{"$f":"'SAL.60%'!C27","v":"Sistemi di Microgenerazione"},{"$f":"IF('SAL.60%'!H27>0,'SAL.60%'!H27-C12,0)","v":0},0.1,0,0,null,{"$f":"IF('SAL.60%'!L27>'SAL.60%'!Q27,'SAL.60%'!Q27-'SAL.60%'!L27,0)","v":0},null,null,null,null,"Totale Imponibile",{"$f":"SUM(K55:K58)","v":0}]
[null,{"$f":"'SAL.60%'!C28","v":"Impianti Biomassa"},{"$f":"IF('SAL.60%'!H28>0,'SAL.60%'!H28-C13,0)","v":0},0.1,0,0,null,{"$f":"IF('SAL.60%'!L28>'SAL.60%'!Q28,'SAL.60%'!Q28-'SAL.60%'!L28,0)","v":0},null,null,null,null,"Totale IVA",{"$f":"SUM(M55:M58)","v":0}]
[null,{"$f":"'SAL.60%'!C29","v":"Sistemi di Building Automation"},{"$f":"IF('SAL.60%'!H29>0,'SAL.60%'!H29-C14,0)","v":0},0.1,0,0,null,{"$f":"IF('SAL.60%'!L29>'SAL.60%'!Q29,'SAL.60%'!Q29-'SAL.60%'!L29,0)","v":0},null,null,null,null,"Totale Fattura",{"$f":"SUM(N55:N58)","v":0}]
[null,{"$f":"'SAL.60%'!C30","v":"Colonnine di Ricarica"},{"$f":"IF('SAL.60%'!H30>0,'SAL.60%'!H30-C15,0)","v":0},0.1,0,0,null,{"$f":"IF('SAL.60%'!L30>'SAL.60%'!Q30,'SAL.60%'!Q30-'SAL.60%'!L30,0)","v":0},null,null,null,null,"Sconto in Fattura ",{"$f":"-'SAL.60%'!N37+N60","v":0}]
[null,{"$f":"'SAL.60%'!C31","v":"Eliminazione Barriere architettoniche"},{"$f":"IF('SAL.60%'!H31>0,'SAL.60%'!H31-C16,0)","v":0},0.1,0,0,null,{"$f":"IF('SAL.60%'!L31>'SAL.60%'!Q31,'SAL.60%'!Q31-'SAL.60%'!L31,0)","v":0},null,null,null,null,"Netto a Pagare",{"$f":"N64+N65","v":0}]
[null,{"$f":"'SAL.60%'!C32","v":"SismaBonus"},{"$f":"IF('SAL.60%'!H32>0,'SAL.60%'!H32-C17,0)","v":0},0.1,0,0,null,{"$f":"IF('SAL.60%'!L32>'SAL.60%'!Q32,'SAL.60%'!Q32-'SAL.60%'!L32,0)","v":0}]
[null,{"$f":"CONCATENATE(\"Spese Tecniche x \",B55)","v":"Spese Tecniche x Isolamento sup. verticali e/o orizzontali"},{"$f":"IF('SAL.60%'!K18>0,('SAL.60%'!K18-'SAL.30%'!K18)/(1+D68),0)","v":0},0.22,0,{"$f":"E68+C68","v":0}]
[null,"Spese Tecniche x Serramenti + chiusure oscuranti",{"$f":"IF('SAL.60%'!K21>0,('SAL.60%'!K21-'SAL.30%'!K21)/(1+D69),0)","v":0},0.22,0,0]
[null,"Spese Tecniche x Schermature solari ",{"$f":"IF('SAL.60%'!K22>0,('SAL.60%'!K22-'SAL.30%'!K22)/(1+D70),0)","v":0},0.22,0,0]
[null,"Spese Tecniche x Solare Termico    - con collettori solari",{"$f":"IF('SAL.60%'!K23>0,('SAL.60%'!K23-'SAL.30%'!K23)/(1+D71),0)","v":0},0.22,0,0,null,"Totali Sp.Tec",null,{"$f":"B52","v":"STATO AVANZAMENTO LAVORI N.2 del 26/07/2021"}]
[null,"Spese Tecniche x Solare Fotovoltaico             kWp",{"$f":"IF('SAL.60%'!K24>0,('SAL.60%'!K24-'SAL.30%'!K24)/(1+D72),0)","v":0},0.22,0,0,null,{"$f":"SUM(F68:F80) +SUM(N57:N58)","v":0},null,"Ripartizione Spese Tecniche","Imponibile","Aliq.Iva","Iva","Importo",null,null,"Applica Sconto Diretto"]
[null,"Spese Tecniche x Sistema di Accumulo             kWp",{"$f":"IF('SAL.60%'!K25>0,('SAL.60%'!K25-'SAL.30%'!K25)/(1+D73),0)","v":0},0.22,0,0,null,null,null,{"$f":"J23","v":"Ape Ante"},{"$f":"$H$72*('Computo-Massimali'!$U$3+'Computo-Massimali'!$X$3)/'Computo-Massimali'!$AC$13","v":0},{"$f":"'Computo-Massimali'!$Z$3","v":0.22},{"$f":"L73*K73","v":0},{"$f":"M73+K73","v":0},null,null,"NO",{"$f":"IF(Q73=\"SI\",N73,0)","v":0}]
[null,"Spese Tecniche x Impianti climatizzazione e ACS",{"$f":"IF('SAL.60%'!K26>0,('SAL.60%'!K26-'SAL.30%'!K26)/(1+D74),0)","v":0},0.22,0,0,null,null,null,{"$f":"J24","v":"Progettazione e DL"},{"$f":"$H$72*('Computo-Massimali'!$U$4+'Computo-Massimali'!$X$4)/'Computo-Massimali'!$AC$13","v":0},{"$f":"'Computo-Massimali'!$Z$4","v":0.22},0,0,null,null,"NO",{"$f":"IF(Q74=\"SI\",N74,0)","v":0}]
[null,"Spese Tecniche x Sistemi di Microgenerazione",{"$f":"IF('SAL.60%'!K27>0,('SAL.60%'!K27-'SAL.30%'!K27)/(1+D75),0)","v":0},0.22,0,0,null,null,null,{"$f":"J25","v":"Coord.SicurezzaEsec."},{"$f":"$H$72*('Computo-Massimali'!$U$5+'Computo-Massimali'!$X$5)/'Computo-Massimali'!$AC$13","v":0},{"$f":"'Computo-Massimali'!$Z$5","v":0.22},0,0,null,null,"NO",0]
[null,"Spese Tecniche x Impianti Biomassa",{"$f":"IF('SAL.60%'!K28>0,('SAL.60%'!K28-'SAL.30%'!K28)/(1+D76),0)","v":0},0.22,0,0,null,null,null,"Ape Post",{"$f":"$H$72*('Computo-Massimali'!$U$7+'Computo-Massimali'!$X$6)/'Computo-Massimali'!$AC$13","v":0},{"$f":"'Computo-Massimali'!$Z$6","v":0.22},0,0,null,null,"NO",0]
[null,"Spese Tecniche x Sistemi di Building Automation",{"$f":"IF('SAL.60%'!K29>0,('SAL.60%'!K29-'SAL.30%'!K29)/(1+D77),0)","v":0},0.22,0,0,null,null,null,0,{"$f":"$H$72*('Computo-Massimali'!$U$7+'Computo-Massimali'!$X$6)/'Computo-Massimali'!$AC$13","v":0},{"$f":"'Computo-Massimali'!$Z$7","v":0},0,0,null,null,"NO",0]
[null,"Spese Tecniche x Colonnine di Ricarica",{"$f":"IF('SAL.60%'!K30>0,('SAL.60%'!K30-'SAL.30%'!K30)/(1+D78),0)","v":0},0.22,0,0,null,null,null,0,{"$f":"$H$72*('Computo-Massimali'!$U$8+'Computo-Massimali'!$X$8)/'Computo-Massimali'!$AC$13","v":0},{"$f":"'Computo-Massimali'!$Z$8","v":0},0,0,null,null,"NO",0]
[null,"Spese Tecniche x Eliminazione Barriere architettoniche",{"$f":"IF('SAL.60%'!K31>0,('SAL.60%'!K31-'SAL.30%'!K31)/(1+D79),0)","v":0},0.22,0,0,null,null,null,0,{"$f":"$H$72*('Computo-Massimali'!$U$9+'Computo-Massimali'!$X$9)/'Computo-Massimali'!$AC$13","v":0},{"$f":"'Computo-Massimali'!$Z$9","v":0},0,0,null,null,"NO",0]
[null,"Spese Tecniche x SismaBonus",{"$f":"IF('SAL.60%'!K32>0,('SAL.60%'!K32-'SAL.30%'!K32)/(1+D80),0)","v":0},0.22,0,0,null,null,null,{"$f":"J30","v":"Visto Conformità"},{"$f":"$H$72*('Computo-Massimali'!$V$12+'Computo-Massimali'!$X$12)/'Computo-Massimali'!$AC$13","v":0},{"$f":"'Computo-Massimali'!$Z$12","v":0.22},0,0,null,null,"NO",0]
[null,null,null,null,null,null,null,null,null,null,null,null,null,{"$f":"SUM(N73:N80)","v":0},null,null,null,{"$f":"SUM(R73:R80)","v":0}]
[null,null,null,null,"Totale Imponibile",{"$f":"SUM(C55:C80)","v":0}]
[null,null,null,null,"A detrarre Importi Direttamente fatturati da Tecnici che applicano sconto in fattura",{"$f":"-R81/(1+D68)","v":0}]
[null,null,null,null,"Sommano",{"$f":"SUM(F82:F83)","v":0}]
[null,null,null,null,"Totale IVA",{"$f":"SUM(E55:E80)-R81*D68","v":0}]
[null,null,null,null,"Totale Fattura",{"$f":"SUM(F55:F80)-R81","v":0}]
[null,null,null,null,"Sconto in Fattura (Spese ammesse)",{"$f":"-(F86+SUM(H55:H67))","v":{"$error":"#VALUE!"}}]
[null,null,null,null,"Netto a Pagare",{"$f":"F86+F87","v":{"$error":"#VALUE!"}}]
[]
[]
[]
[]
[]
[]
[]
[]
[]
[]
[]
[]
[]
[null,{"$f":"CONCATENATE(SAL.Finale!C3,\" del \",SAL.Finale!C4)","v":"STATO AVANZAMENTO LAVORI Finale del 29/07/2021"},null,null,null,null,null,null,null,{"$f":"B102","v":"STATO AVANZAMENTO LAVORI Finale del 29/07/2021"}]
[null,"FATTURA x SUPERBONUS  110%",null,null,null,null,null,null,null,"FATTURA x LAVORI RISTRUTTURAZIONE"]
[null,"Descrizione","Imponibile","Aliq.Iva","Iva","Importo",null,"Ecced.Max Spesa",null,"Descrizione","Imponibile","Aliq.Iva","Iva","Importo"]
[null,{"$f":"SAL.Finale!C18","v":"Isolamento sup. verticali e/o orizzontali"},{"$f":"IF(SAL.Finale!H18>0,SAL.Finale!H18-C55-C5,0)","v":0},0.1,{"$f":"C105*D105","v":0},{"$f":"C105+E105","v":0},null,{"$f":"IF(SAL.Finale!L18>SAL.Finale!Q18,SAL.Finale!Q18-SAL.Finale!L18,0)","v":{"$error":"#VALUE!"}},null,{"$f":"SAL.Finale!C35","v":"Lavori Ristrutturazione"},{"$f":"IF(SAL.Finale!H35>0,SAL.Finale!H35-K55-K5,0)","v":0},0.1,{"$f":"K105*L105","v":0},{"$f":"K105+M105","v":0}]
[null,{"$f":"SAL.Finale!C21","v":"Serramenti + chiusure oscuranti"},{"$f":"IF(SAL.Finale!H21>0,SAL.Finale!H21-C56-C6,0)","v":0},0.1,{"$f":"C106*D106","v":0},{"$f":"C106+E106","v":0},null,{"$f":"IF(SAL.Finale!L21>SAL.Finale!Q21,SAL.Finale!Q21-SAL.Finale!L21,0)","v":0},null,{"$f":"SAL.Finale!C36","v":0},{"$f":"IF(SAL.Finale!H86>0,SAL.Finale!H86-K56-K6,0)","v":0},0.1,{"$f":"K106*L106","v":0},{"$f":"K106+M106","v":0}]
[null,{"$f":"SAL.Finale!C22","v":"Schermature solari "},{"$f":"IF(SAL.Finale!H22>0,SAL.Finale!H22-C57-C7,0)","v":0},0.1,{"$f":"C107*D107","v":0},{"$f":"C107+E107","v":0},null,{"$f":"IF(SAL.Finale!L22>SAL.Finale!Q22,SAL.Finale!Q22-SAL.Finale!L22,0)","v":0},null,{"$f":"CONCATENATE(\"Spese Tecniche x \",J105)","v":"Spese Tecniche x Lavori Ristrutturazione"},{"$f":"IF(SAL.Finale!K35>0,(SAL.Finale!K35-'SAL.60%'!K35-'SAL.30%'!K35)/(1+L107),0)","v":0},0.22,{"$f":"K107*L107","v":0},{"$f":"M107+K107","v":0}]
[null,{"$f":"SAL.Finale!C23","v":"Solare Termico    - con collettori solari"},{"$f":"IF(SAL.Finale!H23>0,SAL.Finale!H23-C58-C8,0)","v":0},0.1,0,0,null,{"$f":"IF(SAL.Finale!L23>SAL.Finale!Q23,SAL.Finale!Q23-SAL.Finale!L23,0)","v":0},null,{"$f":"CONCATENATE(\"Spese Tecniche x \",J106)","v":"Spese Tecniche x 0"},{"$f":"IF(SAL.Finale!K36>0,(SAL.Finale!K36-'SAL.60%'!K36-'SAL.30%'!K36)/(1+L108),0)","v":0},0.22,{"$f":"K108*L108","v":0},{"$f":"M108+K108","v":0}]
[null,{"$f":"SAL.Finale!C24","v":"Solare Fotovoltaico             kWp"},{"$f":"IF(SAL.Finale!H24>0,SAL.Finale!H24-C59-C9,0)","v":0},0.1,0,0,null,{"$f":"IF(SAL.Finale!L24>SAL.Finale!Q24,SAL.Finale!Q24-SAL.Finale!L24,0)","v":0}]
[null,{"$f":"SAL.Finale!C25","v":"Sistema di Accumulo             kWp"},{"$f":"IF(SAL.Finale!H25>0,SAL.Finale!H25-C60-C10,0)","v":0},0.1,0,0,null,{"$f":"IF(SAL.Finale!L25>SAL.Finale!Q25,SAL.Finale!Q25-SAL.Finale!L25,0)","v":0},null,null,null,null,"Oneri Attualizzazione Credito / Quota Sconto  ",{"$f":"IF(SAL.Finale!N37>0,(SAL.Finale!N37-'SAL.60%'!N37-'SAL.30%'!N37)*(1-'Computo-Massimali'!H44),0)","v":0}]
[null,{"$f":"SAL.Finale!C26","v":"Impianti climatizzazione e ACS"},{"$f":"IF(SAL.Finale!H26>0,SAL.Finale!H26-C61-C11,0)","v":0},0.1,0,0,null,{"$f":"IF(SAL.Finale!L26>SAL.Finale!Q26,SAL.Finale!Q26-SAL.Finale!L26,0)","v":{"$error":"#VALUE!"}}]
[null,{"$f":"SAL.Finale!C27","v":"Sistemi di Microgenerazione"},{"$f":"IF(SAL.Finale!H27>0,SAL.Finale!H27-C62-C12,0)","v":0},0.1,0,0,null,{"$f":"IF(SAL.Finale!L27>SAL.Finale!Q27,SAL.Finale!Q27-SAL.Finale!L27,0)","v":0},null,null,null,null,"Totale Imponibile",{"$f":"SUM(K105:K108)","v":0}]
[null,{"$f":"SAL.Finale!C28","v":"Impianti Biomassa"},{"$f":"IF(SAL.Finale!H28>0,SAL.Finale!H28-C63-C13,0)","v":0},0.1,0,0,null,{"$f":"IF(SAL.Finale!L28>SAL.Finale!Q28,SAL.Finale!Q28-SAL.Finale!L28,0)","v":0},null,null,null,null,"Totale IVA",{"$f":"SUM(M105:M108)","v":0}]
[null,{"$f":"SAL.Finale!C29","v":"Sistemi di Building Automation"},{"$f":"IF(SAL.Finale!H29>0,SAL.Finale!H29-C64-C14,0)","v":0},0.1,0,0,null,{"$f":"IF(SAL.Finale!L29>SAL.Finale!Q29,SAL.Finale!Q29-SAL.Finale!L29,0)","v":0},null,null,null,null,"Totale Fattura",{"$f":"SUM(N105:N108)","v":0}]
[null,{"$f":"SAL.Finale!C30","v":"Colonnine di Ricarica"},{"$f":"IF(SAL.Finale!H30>0,SAL.Finale!H30-C65-C15,0)","v":0},0.1,0,0,null,{"$f":"IF(SAL.Finale!L30>SAL.Finale!Q30,SAL.Finale!Q30-SAL.Finale!L30,0)","v":0},null,null,null,null,"Sconto in Fattura ",{"$f":"-SAL.Finale!N37+N110","v":0}]
[null,{"$f":"SAL.Finale!C31","v":"Eliminazione Barriere architettoniche"},{"$f":"IF(SAL.Finale!H31>0,SAL.Finale!H31-C66-C16,0)","v":100000},0.1,10000,110000,null,{"$f":"IF(SAL.Finale!L31>SAL.Finale!Q31,SAL.Finale!Q31-SAL.Finale!L31,0)","v":-118239.89556306614},null,null,null,null,"Netto a Pagare",{"$f":"N114+N115","v":0}]
[null,{"$f":"SAL.Finale!C32","v":"SismaBonus"},{"$f":"IF(SAL.Finale!H32>0,SAL.Finale!H32-C67-C17,0)","v":0},0.1,0,0,null,{"$f":"IF(SAL.Finale!L32>SAL.Finale!Q32,SAL.Finale!Q32-SAL.Finale!L32,0)","v":0}]
[null,{"$f":"CONCATENATE(\"Spese Tecniche x \",B105)","v":"Spese Tecniche x Isolamento sup. verticali e/o orizzontali"},{"$f":"IF(SAL.Finale!K18>0,(SAL.Finale!K18-'SAL.60%'!K18-'SAL.30%'!K18)/(1+D118),0)","v":0},0.22,0,{"$f":"E118+C118","v":0},null,null,null,{"$f":"IF(ABS(N118-'Computo-Massimali'!L38)>0.01,\"ERR. Totale Fatture Ristrutturazioni <> Importo Progetto\",\"Totale Fatture Ristrutturazioni \")","v":"ERR. Totale Fatture Ristrutturazioni <> Importo Progetto"},null,null,null,{"$f":"N114+N64+N14","v":3998.951}]
[null,"Spese Tecniche x Serramenti + chiusure oscuranti",{"$f":"IF(SAL.Finale!K21>0,(SAL.Finale!K21-'SAL.60%'!K21-'SAL.30%'!K21)/(1+D119),0)","v":0},0.22,0,{"$f":"E119+C119","v":0}]
[null,"Spese Tecniche x Schermature solari ",{"$f":"IF(SAL.Finale!K22>0,(SAL.Finale!K22-'SAL.60%'!K22-'SAL.30%'!K22)/(1+D120),0)","v":0},0.22,0,0]
[null,"Spese Tecniche x Solare Termico    - con collettori solari",{"$f":"IF(SAL.Finale!K23>0,(SAL.Finale!K23-'SAL.60%'!K23-'SAL.30%'!K23)/(1+D121),0)","v":0},0.22,0,0,null,"Totali Sp.Tec",null,{"$f":"B102","v":"STATO AVANZAMENTO LAVORI Finale del 29/07/2021"}]
[null,"Spese Tecniche x Solare Fotovoltaico             kWp",{"$f":"IF(SAL.Finale!K24>0,(SAL.Finale!K24-'SAL.60%'!K24-'SAL.30%'!K24)/(1+D122),0)","v":0},0.22,0,0,null,{"$f":"SUM(F118:F130) +SUM(N107:N108)","v":8239.8955630661385},null,"Ripartizione Spese Tecniche","Imponibile","Aliq.Iva","Iva","Importo",null,null,"Applica Sconto Diretto"]
[null,"Spese Tecniche x Sistema di Accumulo             kWp",{"$f":"IF(SAL.Finale!K25>0,(SAL.Finale!K25-'SAL.60%'!K25-'SAL.30%'!K25)/(1+D123),0)","v":0},0.22,0,0,null,null,null,{"$f":"J23","v":"Ape Ante"},{"$f":"$H$122*('Computo-Massimali'!$U$3+'Computo-Massimali'!$X$3)/'Computo-Massimali'!$AC$13","v":172.34780565142256},{"$f":"'Computo-Massimali'!$Z$3","v":0.22},{"$f":"L123*K123","v":37.916517243312967},{"$f":"M123+K123","v":210.26432289473553},null,null,"NO",{"$f":"IF(Q123=\"SI\",N123,0)","v":0}]
[null,"Spese Tecniche x Impianti climatizzazione e ACS",{"$f":"IF(SAL.Finale!K26>0,(SAL.Finale!K26-'SAL.60%'!K26-'SAL.30%'!K26)/(1+D124),0)","v":0},0.22,0,0,null,null,null,{"$f":"J24","v":"Progettazione e DL"},{"$f":"$H$122*('Computo-Massimali'!$U$4+'Computo-Massimali'!$X$4)/'Computo-Massimali'!$AC$13","v":4459.6455241340918},{"$f":"'Computo-Massimali'!$Z$4","v":0.22},981.12201530950017,5440.7675394435919,null,null,"NO",{"$f":"IF(Q124=\"SI\",N124,0)","v":0}]
[null,"Spese Tecniche x Sistemi di Microgenerazione",{"$f":"IF(SAL.Finale!K27>0,(SAL.Finale!K27-'SAL.60%'!K27-'SAL.30%'!K27)/(1+D125),0)","v":0},0.22,0,0,null,null,null,{"$f":"J25","v":"Coord.SicurezzaEsec."},{"$f":"$H$122*('Computo-Massimali'!$U$5+'Computo-Massimali'!$X$5)/'Computo-Massimali'!$AC$13","v":860.71692690641135},{"$f":"'Computo-Massimali'!$Z$5","v":0.22},189.35772391941049,1050.0746508258219,null,null,"NO",0]
[null,"Spese Tecniche x Impianti Biomassa",{"$f":"IF(SAL.Finale!K28>0,(SAL.Finale!K28-'SAL.60%'!K28-'SAL.30%'!K28)/(1+D126),0)","v":0},0.22,0,0,null,null,null,"Ape Post",{"$f":"$H$122*('Computo-Massimali'!$U$6+'Computo-Massimali'!$X$6)/'Computo-Massimali'!$AC$13","v":221.30108086922468},{"$f":"'Computo-Massimali'!$Z$6","v":0.22},48.686237791229431,269.98731866045409,null,null,"NO",0]
[null,"Spese Tecniche x Sistemi di Building Automation",{"$f":"IF(SAL.Finale!K29>0,(SAL.Finale!K29-'SAL.60%'!K29-'SAL.30%'!K29)/(1+D127),0)","v":0},0.22,0,0,null,null,null,0,{"$f":"$H$122*('Computo-Massimali'!$U$7+'Computo-Massimali'!$X$7)/'Computo-Massimali'!$AC$13","v":0},{"$f":"'Computo-Massimali'!$Z$7","v":0},0,0,null,null,"NO",0]
[null,"Spese Tecniche x Colonnine di Ricarica",{"$f":"IF(SAL.Finale!K30>0,(SAL.Finale!K30-'SAL.60%'!K30-'SAL.30%'!K30)/(1+D128),0)","v":0},0.22,0,0,null,null,null,0,{"$f":"$H$122*('Computo-Massimali'!$U$8+'Computo-Massimali'!$X$8)/'Computo-Massimali'!$AC$13","v":0},{"$f":"'Computo-Massimali'!$Z$8","v":0},0,0,null,null,"NO",0]
[null,"Spese Tecniche x Eliminazione Barriere architettoniche",{"$f":"IF(SAL.Finale!K31>0,(SAL.Finale!K31-'SAL.60%'!K31-'SAL.30%'!K31)/(1+D129),0)","v":6754.0127566115889},0.22,1485.8828064545496,8239.8955630661385,null,null,null,0,{"$f":"$H$122*('Computo-Massimali'!$U$9+'Computo-Massimali'!$X$9)/'Computo-Massimali'!$AC$13","v":0},{"$f":"'Computo-Massimali'!$Z$9","v":0},0,0,null,null,"NO",0]
[null,"Spese Tecniche x SismaBonus",{"$f":"IF(SAL.Finale!K32>0,(SAL.Finale!K32-'SAL.60%'!K32-'SAL.30%'!K32)/(1+D130),0)","v":0},0.22,0,0,null,null,null,"Visto Conformità",{"$f":"$H$122*('Computo-Massimali'!$V$12+'Computo-Massimali'!$X$12)/'Computo-Massimali'!$AC$13","v":1039.9999481921175},{"$f":"'Computo-Massimali'!$Z$12","v":0.22},228.79998860226584,1268.7999367943833,null,null,"NO",0]
[null,null,null,null,null,null,null,null,null,null,null,null,null,{"$f":"SUM(N123:N130)","v":8239.8937686189856},null,null,null,{"$f":"SUM(R123:R130)","v":0}]
[null,null,null,null,"Totale Imponibile",{"$f":"SUM(C105:C130)","v":106754.01275661158}]
[null,null,null,null,"A detrarre Importi Direttamente fatturati da Tecnici che applicano sconto in fattura",{"$f":"-R131/(1+D118)","v":0},null,null,null,{"$f":"IF(ABS(N133-'Computo-Massimali'!I10)>0.01,\"ERR. Totale Fatture Spese Tecniche <> Importo Progetto\",\"Totale Fatture Spese Tecniche\")","v":"ERR. Totale Fatture Spese Tecniche <> Importo Progetto"},null,null,null,{"$f":"N131+N81+N31","v":8239.8937686189856}]
[null,null,null,null,"Sommano",{"$f":"SUM(F132:F133)","v":106754.01275661158}]
[null,null,null,null,"Totale IVA",{"$f":"SUM(E105:E130)-R131*D118","v":11485.882806454549}]
[null,null,null,null,"Totale Fattura",{"$f":"SUM(F105:F130)-R131","v":118239.89556306614}]
[null,null,null,null,"Sconto in Fattura (Spese ammesse)",{"$f":"-(F136+SUM(H105:H117))","v":{"$error":"#VALUE!"}}]
[null,null,null,null,"Netto a Pagare",{"$f":"F136+F137","v":{"$error":"#VALUE!"}}]
[]
[]
[null,{"$f":"IF(ABS(F141-'Computo-Massimali'!L34)>0.01,\"ERR. Totali Fatture Superbonus 110 <> Importo Progetto\",\"Totali Fatture Superbonus 110\")","v":"ERR. Totali Fatture Superbonus 110 <> Importo Progetto"},null,null,null,{"$f":"F136+R131+F86+R81+F36+R31","v":165461.06956306615}]